program: Gaussian 09
title: 000267195
version: EM64L-G09RevD.01
frameworkgroup: C1[X(C12H12O2)]
method: RPBEPBE
basis: SDD
operation: Freq
keyword: #pfreq=noraman
keyword: PBEPBE/SDD
title: #p freq=noraman PBEPBE/SDD
converged: NO YES NO NO
title: Mulliken charges:
elementType: O O C C C C C C C C C C C C H H H H H H H H H H H H
charge: -0.243647 -0.231653 -0.397499 -0.343961 -0.499681 -0.063046 -0.502093 0.352409 0.368490 -0.472713 -0.476057 -0.228512 -0.227763 0.003244 0.290550 0.254504 0.253482 0.232434 0.287817 0.252774 0.235019 0.253193 0.246412 0.225875 0.224941 0.205482
chargesum: 0.00000
title: Mulliken charges with hydrogens summed into heavy atoms:
elementType: O O C C C C C C C C C C C C
charge: -0.243647 -0.231653 -0.106949 -0.089457 -0.013765 0.224771 -0.014300 0.352409 0.368490 -0.219520 -0.229645 -0.002637 -0.002822 0.208725
polarizability: 1.60355986e+02 -4.92153229e+00 1.30921323e+02 1.26549847e+01 4.22757454e+00 8.24104008e+01
1716.lowfreq: -11.5505 -0.0005 -0.0001 0.0006 6.9485 16.5706 50.6314 66.7637 123.3760
frequency: 50.6095 66.7549 123.3484 160.8854 186.5400 244.6130 336.7969 349.7214 382.2788 390.5815 413.9278 518.2773 532.7445 563.7714 599.3838 680.7764 718.9421 734.6509 762.9453 779.5322 802.8692 824.9807 842.6640 882.9919 889.6825 901.6983 922.9250 947.9849 958.5072 959.3398 987.6326 993.3440 1008.3026 1014.1891 1046.4779 1067.5521 1086.8643 1114.3389 1137.8778 1152.5550 1164.5032 1167.2896 1172.3995 1202.5726 1234.3598 1260.0059 1270.0660 1284.8445 1292.9666 1309.9977 1329.3185 1343.9331 1399.9440 1448.3631 1456.0044 1458.4506 1480.1655 1600.0818 1616.4664 1622.1778 3022.3636 3025.5708 3029.0022 3068.5384 3089.1183 3095.6923 3100.0019 3104.8076 3120.9501 3129.6495 3141.7630 3159.9671
redmass: 7.2307 5.9263 4.3760 3.5383 4.2190 3.7742 3.8651 3.4805 2.8837 2.9884 3.4120 2.8755 3.4781 3.6507 4.8089 5.1654 4.9307 5.1966 1.4823 3.1194 3.1630 3.4871 3.4314 1.8523 1.6750 2.5555 3.8148 1.4399 1.6214 2.1850 1.3230 1.8097 1.8022 2.2914 1.8177 2.0531 7.5215 1.2862 1.4355 1.5938 1.3957 1.4977 1.2506 1.6665 1.5988 1.9605 1.3365 1.5162 1.4500 1.4645 1.2781 1.1484 5.5575 2.3435 1.6513 1.3226 1.2163 6.7052 8.7864 7.4348 1.0596 1.0605 1.0913 1.0892 1.0900 1.1041 1.1039 1.0946 1.0855 1.0896 1.0948 1.1002
irintensity: 1.5535 1.0530 3.1759 0.2068 2.8912 8.7176 6.4276 7.0470 1.6633 8.9769 3.6708 19.6422 0.4399 0.6880 2.6803 2.3355 1.1318 2.5958 65.5124 16.2393 6.4813 2.0485 1.5741 2.3141 1.0592 3.5838 2.1399 2.0123 2.3198 20.2450 0.2653 16.0081 22.8783 6.6836 5.5114 38.8527 329.6818 2.0032 0.0054 0.9535 0.5838 5.3678 2.5272 1.1952 2.3980 0.8671 2.0226 3.2125 1.4071 4.8181 25.0143 0.7727 1.6930 3.5029 10.7902 14.0939 18.6284 0.8261 245.7081 2.0526 33.3517 20.8864 72.2365 7.2153 38.7529 18.7369 37.0734 3.7835 1.8136 4.7039 31.0713 32.1354
temp: 298.150 k
press: 1.00000 atm
elementType: 8 8 6 6 6 6 6 6 6 6 6 6 6 6 1 1 1 1 1 1 1 1 1 1 1 1
symmnumber: 1
zpe: 552323.0 jmol-1
zpe.correction: 0.210369 hartree
zpe.thermalcorrener: 0.221228 hartree
zpe.thermalcorrenthalpy: 0.222173 hartree
zpe.thermalcorrgfe: 0.173122 hartree
zpe.sumelectzpe: -613.907777 hartree
zpe.sumelectthermal: -613.896917 hartree
zpe.sumelectthermalent: -613.895973 hartree
zpe.sumelectthermalfe: -613.945023 hartree
dipole: -0.7862 -2.1511 0.0598
dipole: 2.2911
quadrupole: -77.7438 -82.2212 -81.8259
quadrupole: -5.9175 3.4319 1.9734
quadrupole: 2.8532 -1.6242 -1.2289 -5.9175 3.4319 1.9734
hfenergy: -614.1181452 hartree
pointgroup: C01 [X(C12H12O2)]
dipole: 0.2083057 -0.8558294 -0.1914464 debye
dipolederiv: -1.2782604 0.533411 0.0087574 0.5915628 -0.9710692 -0.090157 0.0072253 -0.0118899 -0.2806508 -0.4458045 -0.1536349 -0.0778855 0.4093512 -0.9630437 -0.1219471 0.1052094 -0.2302783 -0.3634311 -0.0722875 -0.0171898 -0.0176014 -0.1143273 0.0656779 -0.041547 0.0356426 0.0065755 0.0521621 0.0009779 -0.0322648 -0.0543724 0.0228725 0.2102134 0.0438619 -0.0025897 0.0898047 0.0704865 0.0533688 0.023475 -0.0214555 0.012221 -0.0463197 0.0051802 0.0020634 0.0031203 0.0399455 0.8643969 -0.2822454 -0.0219373 -0.0328567 0.2337762 0.0099954 -0.0368519 -0.1048595 0.2392849 -0.0159647 0.0107802 0.0385716 -0.0338362 -0.0826084 -0.0068373 -0.015201 -0.0316398 0.0561335 0.2129509 0.0548697 0.0957726 -0.1773884 -0.1222279 -0.0427135 0.124772 -0.0050461 -0.0707548 0.0835765 0.1080644 0.0573905 0.2872625 0.0203432 0.075188 0.0099796 -0.0036351 -0.085531 -0.0850923 -0.039476 0.0335868 0.0049041 0.1015656 -0.0064865 0.048545 -0.0040463 -0.1282639 -0.0738708 -0.0920239 0.0414956 -0.0971329 0.0769944 -0.0254768 0.0476583 -0.0262574 -0.1355069 -0.0527871 0.0554951 0.0557617 0.0948687 0.0198291 0.0374936 0.0451203 0.02511 -0.1359473 0.0284008 -0.0116989 0.0837086 -0.0677237 -0.0340338 -0.0181204 0.0754058 0.0021809 -0.1226847 1.0369239 -0.2109753 0.1348472 -0.8669276 1.5776352 0.2606683 -0.0187026 0.3199353 0.2636189 0.0285912 0.030945 -0.032397 0.0659753 -0.0734415 0.062577 -0.0394844 0.0375997 0.0350634 0.0195708 0.0649295 0.0110639 0.025176 -0.1484288 -0.0476127 -0.0020185 -0.0388447 0.0534092 0.0061877 0.0077041 0.1400428 0.0017447 0.0662974 0.0271502 0.1085001 0.0087501 -0.0739143 -0.1206896 -0.0834432 -0.1247467 -0.0781152 0.0624283 -0.0345578 -0.0890711 -0.0117312 0.0498335 -0.024733 0.0501269 0.0128033 0.0045083 0.0143054 -0.0797685 -0.0181669 -0.0338576 -0.0473735 -0.0964661 -0.1302926 -0.010217 -0.0840007 0.0279693 0.0033016 -0.0055418 -0.0264411 0.0837055 0.0587442 0.0614559 -0.0502885 0.0235148 0.0498444 0.018745 -0.0282361 0.0559823 -0.1214715 0.0848269 0.0698618 -0.0309161 0.0362466 -0.0747229 0.0142603 -0.0335696 0.0190812 0.1339392 0.0792903 0.0379803 -0.031647 0.0734933 -0.0970242 0.0242994 -0.0367631 0.0133793 0.1352433 -0.0076738 -0.0999938 -0.0657715 -0.1093 -0.0319496 -0.0448628 -0.0707914 -0.0420882 0.1313918 -0.1046954 0.0347848 -0.1040402 0.0367416 0.0771425 0.0145813 -0.1056023 0.0117413 0.1156491 -0.1794815 0.0093549 -0.070526 -0.0288348 0.0408472 -0.0372149 -0.1075314 -0.0226454 0.1056634 unknown
polarizability: 157.7101932|-2.4634072|130.4326331|19.9616755|4.3713052|85.5448838 unknown
InChI: InChI=1S/C12H12O2/c13-7-14-12-6-8-5-11(12)10-4-2-1-3-9(8)10/h1-4,7-8,11-12H,5-6H2
charge 0 multiplicity 1
26 atoms
O  -2.869019 -0.034754 -0.110321
O  -3.072401 2.248379 0.401638
C  -0.512691 0.477672 -0.861167
C  0.134492 -1.706384 -0.580366
C  -0.432228 -0.81674 -1.737511
C  -1.425204 -0.03174 0.309476
C  -0.997827 -1.519877 0.49839
C  0.903175 0.5127 -0.283604
C  1.312511 -0.842935 -0.12242
C  1.736911 1.572335 0.104834
C  2.566298 -1.155407 0.424606
C  3.016573 1.25987 0.639527
C  3.425808 -0.085184 0.796011
C  -3.550336 1.168759 -0.001982
H  -0.871117 1.406876 -1.326201
H  0.36309 -2.756926 -0.813678
H  0.266024 -0.712816 -2.584587
H  -1.420757 -1.153206 -2.097878
H  -1.337657 0.600171 1.208204
H  -1.859526 -2.175609 0.283626
H  -0.642636 -1.727302 1.520624
H  1.420358 2.615672 -0.00514
H  2.887702 -2.194887 0.557639
H  3.694778 2.069567 0.931964
H  4.418112 -0.303803 1.207107
H  -4.596231 1.007573 -0.327893
