program: Gaussian 09
title: 000267355
version: EM64L-G09RevD.01
frameworkgroup: C1[X(C26H28O5)]
method: RPBEPBE
basis: SDD
operation: Freq
keyword: #pfreq=noraman
keyword: PBEPBE/SDD
title: #p freq=noraman PBEPBE/SDD
converged: YES YES NO NO
title: Mulliken charges:
elementType: O O O O O C C C C C C C C C C C C C C C C C C C C C C C C C C H H H H H H H H H H H H H H H H H H H H H H H H H H H H
charge: -0.225117 -0.293818 -0.278628 -0.282006 -0.444117 -0.052401 -0.040321 -0.094345 -0.167172 -0.359567 -0.430029 -0.465604 -0.439714 0.408557 0.422665 0.424429 -0.420793 -0.393682 -0.389768 -0.350074 -0.393843 -0.389342 -0.231573 -0.237015 -0.227550 -0.230504 -0.227014 -0.217547 -0.247789 -0.241145 -0.255116 0.258740 0.252910 0.264224 0.239761 0.228373 0.234156 0.242345 0.219500 0.231848 0.199258 0.226563 0.230563 0.359614 0.233432 0.314190 0.244079 0.248825 0.230152 0.270395 0.226204 0.229092 0.228985 0.232193 0.224345 0.219817 0.227414 0.227216 0.225752
chargesum: 0.00000
title: Mulliken charges with hydrogens summed into heavy atoms:
elementType: O O O O O C C C C C C C C C C C C C C C C C C C C C C C C C C
charge: -0.225117 -0.293818 -0.278628 -0.282006 -0.084503 0.206339 0.212588 0.169879 0.072589 0.102961 0.031816 -0.034498 0.017412 0.408557 0.422665 0.424429 -0.187361 -0.079492 -0.145689 -0.101249 -0.163691 -0.118947 -0.005369 -0.007922 0.001435 0.001689 -0.002669 0.002270 -0.020374 -0.013929 -0.029364
polarizability: 2.86423693e+02 2.09231150e+01 2.92630962e+02 -1.33147064e+01 1.05630206e+01 2.37223622e+02
1716.lowfreq: -16.5983 -6.8127 -0.0007 -0.0005 -0.0004 6.4410 8.0142 20.6082 23.5338
frequency: -12.1398 20.1875 23.4963 32.9610 35.8361 41.3975 45.0670 48.4679 65.0170 72.6921 89.9432 98.1973 115.4761 137.9601 171.3202 175.8355 193.5601 199.2519 213.9014 229.9091 252.9710 270.1122 306.3713 317.6093 329.4061 339.5178 350.7030 396.8363 401.7918 402.2895 402.5302 405.3466 422.4014 445.8572 457.2207 466.0857 474.6367 483.8992 494.3994 566.5520 580.2648 588.0252 594.7637 614.6086 614.8622 615.3431 658.5869 703.0171 703.9558 705.6174 718.4612 738.2558 742.8669 749.8116 789.5987 795.7243 805.2856 820.2919 847.1380 857.1057 858.7713 864.9399 884.1311 885.9335 893.8109 909.8819 919.3513 923.2022 933.5300 954.9282 980.1218 980.6609 981.2506 985.1767 988.1685 989.0516 989.9649 990.5776 994.0110 998.1630 1010.5805 1010.6208 1013.1486 1018.1002 1021.1681 1024.7518 1026.2059 1029.7192 1056.3219 1068.8938 1079.2471 1084.9619 1088.8007 1091.8986 1125.8874 1168.7286 1170.6799 1171.9489 1180.0704 1185.0058 1187.9381 1191.1062 1203.2854 1205.4043 1207.1821 1212.8472 1227.8640 1244.0788 1252.7142 1253.1965 1297.0959 1299.0479 1308.2660 1314.1106 1318.3162 1322.5474 1337.8373 1343.8650 1345.6349 1347.1803 1350.2289 1361.2100 1370.9048 1384.5533 1387.1916 1388.3673 1393.1545 1436.7251 1438.1711 1439.4275 1440.0064 1450.9849 1454.3735 1465.6148 1480.9047 1482.4053 1483.7077 1591.0803 1592.0178 1592.8557 1611.7181 1612.1127 1613.7180 2967.3621 2969.5260 2974.5875 3012.6743 3016.9062 3022.3098 3032.5998 3038.2583 3044.7861 3051.8315 3053.6615 3107.6231 3108.7288 3108.7633 3119.6248 3122.4470 3123.4173 3124.7671 3134.7767 3135.4858 3135.9654 3146.6222 3148.3883 3152.8597 3160.4727 3162.1278 3163.7775 3546.1333
redmass: 4.6385 5.3659 5.5495 4.9334 4.5227 4.2617 4.5036 4.0676 4.4496 4.3964 5.0213 6.0299 5.1639 5.6173 4.9664 5.1334 4.2509 5.1028 3.2709 5.4790 2.8037 4.0324 3.3472 3.1032 2.2321 2.1201 2.1160 4.0191 3.2663 3.0294 3.2486 2.9197 4.4415 3.4129 3.2331 3.7427 4.1788 5.4743 4.7050 5.4787 5.5139 5.2303 4.5424 6.4108 6.3598 6.3612 3.4618 2.4528 1.9991 2.4014 3.4999 1.4639 1.4683 1.8629 4.3427 3.9866 3.5456 3.9598 3.5196 1.2624 1.2563 1.2646 4.3231 3.0157 3.0307 1.5044 1.4083 1.4790 4.3875 2.8868 1.5189 1.4794 1.5621 2.5521 5.5223 1.9278 4.0683 2.9087 1.4799 1.4023 1.9899 3.6195 2.6772 2.5616 2.4105 2.1775 2.2725 2.3304 3.7540 2.4013 1.5970 1.6985 1.6170 2.3763 3.1292 1.0594 1.0560 1.0563 1.1350 1.1699 1.1238 1.1345 2.2597 2.6261 2.1597 1.3440 1.3085 1.2147 1.1993 1.3457 1.1819 1.3879 1.2544 1.3200 1.2003 1.2610 1.3526 1.3153 1.3338 1.3051 1.3009 1.4605 1.3606 5.9755 3.3177 4.4102 1.6537 1.9708 1.2896 2.0915 1.7322 1.1066 1.1166 1.0874 2.2844 2.2059 2.1977 5.9974 6.1219 6.0590 5.9754 5.8326 6.0450 1.0635 1.0605 1.0614 1.0634 1.0835 1.0853 1.0876 1.1012 1.0838 1.0992 1.0998 1.0874 1.0982 1.0931 1.0849 1.0862 1.0866 1.0875 1.0921 1.0921 1.0925 1.0964 1.0953 1.0956 1.1013 1.1015 1.0990 1.0654
irintensity: 0.1050 0.0480 0.3008 0.3757 0.1850 0.1170 0.0388 0.1243 0.5068 0.2199 1.2790 0.4216 1.2564 0.5020 0.1287 1.0139 1.7212 0.6573 1.2490 5.3920 16.9928 8.2837 4.2437 24.7524 34.0815 23.4997 42.1004 18.5734 3.3964 0.3822 1.4739 0.0652 14.4498 7.5066 7.3441 8.5573 35.3695 8.8876 3.6525 26.6552 24.7324 3.9148 9.5280 0.1926 0.2707 0.2629 0.9780 33.3333 43.2618 34.7072 13.2566 100.7275 73.1076 62.5354 3.5737 5.2220 10.0618 24.0896 24.7842 0.2662 0.9406 1.3095 22.9813 29.5284 14.4866 1.3415 19.6088 14.1883 86.3039 14.3193 1.8932 0.7023 3.0573 49.4704 1.4593 3.1582 0.5174 3.5173 6.0138 19.5488 54.4925 110.1275 59.8234 35.7005 33.3780 11.6485 9.4390 11.7971 65.1111 7.5871 9.7669 12.8160 9.4412 63.9566 17.9192 0.2711 0.1272 0.2292 1.2727 9.9205 0.8054 4.0463 4.0115 12.6821 17.4557 5.0217 15.6862 12.4175 1.1205 20.5551 16.5758 5.7823 5.5417 3.6333 5.0673 3.2322 12.6924 15.0944 2.8751 8.7318 1.8828 3.6489 8.0703 2.2539 0.6270 1.9517 3.3851 7.0662 17.5611 6.8790 5.6587 21.9109 10.6401 11.2701 13.1527 5.2224 9.3584 1.1383 0.5048 0.6442 0.5317 2.0937 5.1372 51.9140 24.4273 40.7787 35.9479 16.7453 9.3113 30.0484 13.4557 8.9643 11.6451 17.9385 8.9720 9.0651 19.8368 1.3299 1.2058 3.1026 0.2222 20.8472 22.5027 30.7559 30.0751 6.1527 28.8833 34.9926 15.2346 14.3687 6.4698
temp: 298.150 k
press: 1.00000 atm
elementType: 8 8 8 8 8 6 6 6 6 6 6 6 6 6 6 6 6 6 6 6 6 6 6 6 6 6 6 6 6 6 6 1 1 1 1 1 1 1 1 1 1 1 1 1 1 1 1 1 1 1 1 1 1 1 1 1 1 1 1
symmnumber: 1
zpe: 1261464.5 jmol-1
zpe.correction: 0.480466 hartree
zpe.thermalcorrener: 0.507693 hartree
zpe.thermalcorrenthalpy: 0.508637 hartree
zpe.thermalcorrgfe: 0.420771 hartree
zpe.sumelectzpe: -1381.351469 hartree
zpe.sumelectthermal: -1381.324242 hartree
zpe.sumelectthermalent: -1381.323298 hartree
zpe.sumelectthermalfe: -1381.411164 hartree
dipole: 0.4955 -2.3431 -0.8863
dipole: 2.5537
quadrupole: -173.6332 -173.2963 -180.3159
quadrupole: 4.0925 -0.3432 -7.8505
quadrupole: 2.1152 2.4522 -4.5674 4.0925 -0.3432 -7.8505
hfenergy: -1381.8319352 hartree
pointgroup: C01 [X(C26H28O5)]
dipole: 0.251598 -0.4455954 -0.8646236 debye
polarizability: 269.068506|-22.6578564|248.8524634|21.9425809|5.8106218|298.3573078 unknown
InChI: InChI=1S/C26H28O5/c27-26-25(30-18-22-14-8-3-9-15-22)24(29-17-21-12-6-2-7-13-21)23(19-31-26)28-16-20-10-4-1-5-11-20/h1-15,23-27H,16-19H2
charge 0 multiplicity 1
59 atoms
O  1.120686 0.187606 4.016113
O  1.208347 0.901461 0.503086
O  -0.378747 -1.955992 2.419744
O  -1.206251 2.225326 1.876283
O  2.960668 -0.50301 2.622238
C  0.15402 0.160107 1.217494
C  0.727027 -1.12874 1.892601
C  -0.425127 1.06639 2.324127
C  1.626028 -0.842024 3.11906
C  0.69004 1.430502 3.32664
C  1.27792 0.665851 -0.949981
C  -0.859584 -3.01925 1.507208
C  -0.537785 3.272632 1.085343
C  2.032127 -0.59183 -1.368013
C  -1.79882 -2.526143 0.41708
C  -0.923567 3.225594 -0.389492
C  1.646111 -1.283395 -2.543883
C  3.162777 -1.043712 -0.640935
C  -1.477463 -2.694288 -0.952034
C  -3.022125 -1.894437 0.76438
C  -0.20271 4.007124 -1.327954
C  -2.006559 2.435593 -0.843098
C  2.382965 -2.402763 -2.996617
C  3.893397 -2.167512 -1.088196
C  -2.361679 -2.241008 -1.959439
C  -3.904316 -1.437779 -0.237972
C  -0.557481 4.000277 -2.695422
C  -2.359181 2.421934 -2.212825
C  3.510983 -2.848294 -2.268893
C  -3.576548 -1.611786 -1.60502
C  -1.638263 3.203934 -3.144373
H  -0.643124 -0.1343 0.508881
H  1.318496 -1.702926 1.154753
H  -1.173063 0.462055 2.86912
H  1.6528 -1.743455 3.759167
H  1.556617 1.901539 2.827264
H  0.300888 2.079622 4.125749
H  1.806238 1.561188 -1.327433
H  0.258006 0.672343 -1.385749
H  -1.386016 -3.709225 2.19092
H  0.006538 -3.552479 1.063417
H  0.560612 3.215161 1.185471
H  -0.884996 4.22812 1.526667
H  3.531249 -0.313484 3.411484
H  0.768267 -0.941893 -3.108067
H  3.440383 -0.531674 0.287072
H  -0.530977 -3.172006 -1.233722
H  -3.270765 -1.753285 1.82302
H  0.64243 4.621152 -0.989682
H  -2.561032 1.835304 -0.11468
H  2.077251 -2.925202 -3.910656
H  4.761949 -2.511474 -0.514857
H  -2.101989 -2.378568 -3.015239
H  -4.845319 -0.951375 0.042822
H  0.009601 4.609017 -3.409205
H  -3.196895 1.799659 -2.549091
H  4.0827 -3.716484 -2.61634
H  -4.264225 -1.263458 -2.384225
H  -1.913414 3.195462 -4.205212
