program: Gaussian 09
title: 000267193
version: EM64L-G09RevD.01
frameworkgroup: C1[X(C15H11NO2)]
method: RPBEPBE
basis: SDD
operation: Freq
keyword: #p
keyword: freq=noraman
keyword: PBEPBE/SDD
title: #p freq=noraman PBEPBE/SDD
converged: YES YES NO NO
title: Mulliken charges:
elementType: O O N C C C C C C C C C C C C C C C H H H H H H H H H H H
charge: -0.222811 -0.222365 -0.154582 0.131842 0.255742 0.223444 -0.359571 0.289334 -0.323976 -0.348431 -0.634487 -0.272184 -0.223608 0.032039 -0.498728 0.134630 -0.270433 -0.283914 0.311154 0.231064 0.240147 0.245821 0.243043 0.245010 0.228848 0.228331 0.252166 0.259396 0.263078
chargesum: 0.00000
title: Mulliken charges with hydrogens summed into heavy atoms:
elementType: O O N C C C C C C C C C C C C C C C
charge: -0.222811 -0.222365 -0.154582 0.131842 0.255742 0.223444 -0.048417 0.289334 -0.092912 -0.108284 0.099388 -0.043336 0.004723 0.032039 -0.246562 0.134630 -0.011037 -0.020836
polarizability: 3.23747351e+02 1.90941428e+01 2.15571832e+02 -3.47115057e+00 -2.04195057e+00 7.50951129e+01
1716.lowfreq: -6.6619 -0.0003 -0.0002 -0.0001 4.7265 9.0935 32.5506 59.3576 85.0623
frequency: 32.5102 59.3559 85.0613 104.8972 118.4790 142.6388 184.3456 216.1997 232.3256 254.2057 270.1066 285.0476 331.0933 404.9741 424.0242 445.0263 454.9763 491.9114 532.9731 553.3933 574.1063 583.3871 598.2321 628.1570 659.2121 727.8880 750.4642 752.9842 764.4492 776.6050 779.2654 825.6869 838.3133 853.8482 858.7907 893.2724 926.1088 936.8008 977.8058 996.4519 1023.1717 1037.0762 1068.5676 1092.6390 1120.8866 1133.9523 1138.5149 1172.8383 1190.4672 1225.0540 1260.4458 1284.7785 1301.8766 1332.7879 1355.6284 1361.2493 1386.0879 1409.3391 1434.4373 1467.4782 1468.4822 1469.1226 1486.9703 1499.1389 1530.4216 1548.8104 1573.8402 1583.4695 1622.4256 1636.5128 2987.4540 3068.5752 3117.8480 3133.0614 3140.3319 3144.4418 3160.6910 3166.7181 3173.9851 3187.8597 3253.2810
redmass: 6.2545 4.6111 6.0606 6.8400 1.1330 2.6547 5.2630 4.8008 3.8896 5.2032 4.4889 5.3474 5.2868 8.7105 2.9352 3.5022 10.7915 5.3198 5.4264 4.5494 3.6904 3.5373 4.8235 5.8126 3.1410 5.6283 4.7006 1.3647 3.8007 2.6865 4.6834 3.6540 1.8970 1.5056 1.9260 1.7168 3.6084 1.4016 1.3159 1.3005 2.1907 3.4874 2.1055 1.6666 1.3180 2.1055 1.4829 1.1826 1.4673 1.6101 2.2586 2.1634 2.3439 2.1493 2.7423 3.7005 3.4773 5.0556 1.5209 2.4182 1.0470 3.2312 2.2705 1.6147 7.0181 7.5677 8.1872 6.7457 7.3060 7.0487 1.0353 1.1020 1.0996 1.0855 1.0866 1.0904 1.0958 1.1010 1.0982 1.0903 1.0987
irintensity: 0.3556 5.2078 3.0535 2.5109 0.6444 3.3461 4.2804 0.6251 1.5098 1.3811 1.1461 0.8594 0.1063 54.4350 11.5283 4.2136 1.1054 2.0456 1.6250 8.7440 0.4644 2.7088 3.4881 3.8069 2.4065 1.2768 8.0988 100.4198 5.2452 2.1382 2.4676 1.0074 0.8267 9.3953 29.2737 49.9626 23.8632 2.0150 0.0824 0.1154 6.6663 2.2288 138.1983 46.8678 0.8684 82.0614 5.4124 6.3773 2.9658 46.6054 71.2321 9.4250 145.6153 45.2550 6.1514 79.2071 69.2374 39.6374 10.4835 0.5547 18.5429 108.4255 118.5862 87.1750 49.6962 301.2014 281.3421 23.7859 1.9777 30.4221 67.2297 20.4286 6.8961 0.0301 1.8954 12.1283 31.1300 17.5055 11.5669 5.1606 10.5067
temp: 298.150 k
press: 1.00000 atm
elementType: 8 8 7 6 6 6 6 6 6 6 6 6 6 6 6 6 6 6 1 1 1 1 1 1 1 1 1 1 1
symmnumber: 1
zpe: 574662.6 jmol-1
zpe.correction: 0.218877 hartree
zpe.thermalcorrener: 0.233569 hartree
zpe.thermalcorrenthalpy: 0.234513 hartree
zpe.thermalcorrgfe: 0.176553 hartree
zpe.sumelectzpe: -782.145365 hartree
zpe.sumelectthermal: -782.130674 hartree
zpe.sumelectthermalent: -782.129730 hartree
zpe.sumelectthermalfe: -782.187689 hartree
dipole: 4.9969 3.1184 0.1243
dipole: 5.8915
quadrupole: -89.6094 -104.8770 -108.0629
quadrupole: -3.3867 3.3852 5.1960
quadrupole: 11.2404 -4.0272 -7.2131 -3.3867 3.3852 5.1960
hfenergy: -782.3642429 hartree
pointgroup: C01 [X(C15H11N1O2)]
dipole: -1.9421926 1.2504163 0.19209 debye
polarizability: 322.2353163|-24.5717108|202.107974|9.5821207|41.8166078|90.0710062 unknown
InChI: InChI=1S/C15H11NO2/c1-16-9-13(11-4-2-3-5-14(11)16)12-8-10(17)6-7-15(12)18/h2-9H,1H3
charge 0 multiplicity 1
29 atoms
O  1.730685 2.302447 1.345251
O  3.80492 -2.229097 -0.894721
N  -2.174391 1.60513 0.104128
C  -1.258949 -0.478187 -0.245056
C  -0.177424 0.46758 0.067269
C  -2.488625 0.268053 -0.214391
C  -0.807004 1.716497 0.280259
C  1.256902 0.223319 0.126789
C  -1.338816 -1.87429 -0.494102
C  -3.752516 -0.30892 -0.448185
C  -3.151933 2.688752 0.232865
C  -2.599315 -2.465148 -0.725078
C  -3.793941 -1.693904 -0.713103
C  2.16344 1.226514 0.816199
C  1.855137 -0.902429 -0.430742
C  3.290663 -1.182456 -0.361532
C  3.620078 0.934339 0.883761
C  4.158314 -0.196965 0.344029
H  -0.341203 2.660564 0.547811
H  -0.448697 -2.50848 -0.489095
H  -4.67128 0.286343 -0.419873
H  -3.889476 2.456985 1.022444
H  -2.630176 3.619794 0.502242
H  -3.689072 2.846875 -0.719758
H  -2.658988 -3.54207 -0.915663
H  -4.756229 -2.181814 -0.901595
H  1.272554 -1.630555 -0.999614
H  4.222528 1.690702 1.399069
H  5.228812 -0.42738 0.389789
