program: Gaussian 09
title: 000267187
version: EM64L-G09RevD.01
frameworkgroup: C1[X(C10H9N3O3)]
method: RPBEPBE
basis: SDD
operation: Freq
keyword: #p
keyword: freq=noraman
keyword: PBEPBE/SDD
title: #p freq=noraman PBEPBE/SDD
converged: YES YES NO YES
title: Mulliken charges:
elementType: O O O N N N C C C C C C C C C C H H H H H H H H H
charge: -0.197355 -0.269295 -0.196811 -0.066448 0.018901 -0.647313 0.431385 -0.236460 0.121629 0.416989 0.185390 -0.604002 -0.298051 -0.186134 -0.372739 -0.539285 0.249315 0.327051 0.233603 0.247076 0.310448 0.358664 0.264038 0.224709 0.224698
chargesum: 0.00000
title: Mulliken charges with hydrogens summed into heavy atoms:
elementType: O O O N N N C C C C C C C C C C
charge: -0.197355 -0.269295 -0.196811 -0.066448 0.018901 0.021798 0.431385 -0.236460 0.121629 0.416989 0.185390 -0.354687 0.029000 0.047469 -0.125664 0.174159
polarizability: 2.24055633e+02 -3.83485343e-01 1.93487339e+02 3.50904962e-02 -1.29690441e-02 5.92627973e+01
1716.lowfreq: -71.9637 -4.0970 -0.0001 0.0007 0.0008 9.7064 10.2331 41.2330 89.5969
frequency: -71.9608 41.2270 89.5843 122.6657 178.5574 204.4645 209.9816 262.0783 272.4494 289.3995 328.1539 341.3328 366.4142 373.3154 419.1323 454.5613 475.2968 529.1072 534.2513 598.0428 631.0085 639.1028 641.3217 657.5809 691.5134 719.2307 737.8221 798.8456 813.0096 822.6820 838.5787 882.3269 945.6317 975.8327 1013.4416 1030.0856 1060.2303 1084.9498 1103.7749 1122.2996 1151.4636 1155.7210 1195.2766 1209.6826 1244.0127 1286.7641 1332.7482 1344.8305 1380.3076 1414.1222 1416.0378 1438.3417 1457.0068 1467.0468 1474.8776 1512.3855 1544.5235 1571.0780 1582.0981 1639.6136 2969.6622 3066.1434 3135.3206 3137.3776 3164.3118 3172.3213 3222.0464 3467.5919 3672.4814
redmass: 14.1046 5.5030 4.0177 4.1147 4.1648 2.3523 3.5003 8.5402 1.4474 3.7892 8.3262 6.1498 5.7848 8.3475 2.4476 5.9920 1.3707 6.3473 4.3673 7.5924 6.2388 3.1099 4.2214 4.7198 9.1517 1.1952 9.1559 2.6606 5.6592 1.4155 2.4922 8.1647 1.4145 9.4718 1.3370 3.2752 2.0329 2.3154 1.2547 2.5599 2.1560 1.4619 4.5384 2.3758 1.8990 3.8339 4.9004 4.2172 2.8723 2.9480 1.8443 2.4678 2.1306 1.1000 1.0503 4.1004 4.4003 2.9333 2.0145 5.8624 1.0325 1.1048 1.0893 1.0999 1.0961 1.0899 1.0933 1.0504 1.0981
irintensity: 0.0032 2.4569 0.0888 9.2262 1.6338 1.2980 3.8651 1.7864 0.0092 10.1252 0.5385 10.4241 2.5865 0.4807 47.6218 9.6270 80.7662 3.5114 1.3437 4.5966 5.3386 0.0219 15.4087 3.3765 0.3359 134.6143 14.4985 23.4888 6.3399 43.8519 35.1662 8.8518 0.4475 18.2383 2.3612 20.8226 0.9018 40.8790 0.1490 6.0040 236.0903 27.1569 206.3262 128.2483 120.6439 98.1426 38.3232 10.9545 73.2610 6.0614 67.2456 23.5814 64.7244 76.0409 15.2328 61.1696 30.6138 58.6002 170.0468 470.6583 59.0895 38.9920 13.9796 11.8114 24.9121 8.1202 15.9094 131.9534 63.4772
temp: 298.150 k
press: 1.00000 atm
elementType: 8 8 8 7 7 7 6 6 6 6 6 6 6 6 6 6 1 1 1 1 1 1 1 1 1
symmnumber: 1
zpe: 479250.8 jmol-1
zpe.correction: 0.182537 hartree
zpe.thermalcorrener: 0.195181 hartree
zpe.thermalcorrenthalpy: 0.196126 hartree
zpe.thermalcorrgfe: 0.143576 hartree
zpe.sumelectzpe: -775.159119 hartree
zpe.sumelectthermal: -775.146474 hartree
zpe.sumelectthermalent: -775.145530 hartree
zpe.sumelectthermalfe: -775.198080 hartree
dipole: 2.0698 7.9039 0.0008
dipole: 8.1704
quadrupole: -82.2401 -85.1321 -94.5818
quadrupole: -18.8364 -0.0151 0.0036
quadrupole: 5.0779 2.1859 -7.2638 -18.8364 -0.0151 0.0036
hfenergy: -775.3416555 hartree
pointgroup: C01 [X(C10H9N3O3)]
dipole: 0.8009484 3.1131143 0.0003109 debye
dipolederiv: -1.653974 0.6477491 0.0003197 0.2286297 -0.278931 0.0001151 0.0003337 -0.0000117 -0.2522516 -0.5020569 0.2917978 -0.001078 0.0355876 -1.0491101 0.0011935 -0.0006849 0.0007866 -0.2735448 -1.0014292 -0.3530766 -0.001304 -0.2053898 -0.5118119 -0.0000776 -0.0022143 -0.0003499 -0.2255493 -0.3042759 -0.2679758 -0.0000461 0.0422212 -0.3394853 -0.0000244 -0.000108 -0.0000947 -0.2227964 1.3025822 0.4209547 0.0028682 0.4814529 1.9275312 -0.0012972 0.0030431 -0.0008314 0.1925793 -0.5839929 -0.5825272 0.0000784 -0.6015427 -1.3852341 -0.0000012 0.0000909 0.0000261 -0.6248024 0.658985 0.1392032 -0.0000299 0.1900065 -0.1814842 -0.0000301 0.0002181 0.0007123 0.1196469 0.0126435 0.435323 0.0000297 -0.4113967 -0.3487803 0.0000403 0.0002175 0.000128 -0.0253948 -0.6624893 -0.1852693 -0.0003901 -0.2285162 -1.1404581 0.0000536 -0.0000623 0.0001555 -0.0798463 0.8354474 0.5992544 -0.0000929 0.5100512 1.4584786 -0.0000505 -0.0001128 -0.0001506 0.1766572 1.4534076 -0.4790518 -0.0004022 0.326532 0.926551 -0.0000513 -0.0007207 -0.0005021 0.1711761 -0.7919883 -0.579369 0.0001283 -0.3751077 -0.3603791 0.0000557 0.0001071 -0.0000167 -0.2953497 -0.1520663 -0.0524223 -0.0000695 0.0296802 0.1046623 0.0000293 -0.000065 0.0000111 -0.1227737 -0.0789258 -0.0161599 -0.0000241 -0.1738416 0.1733614 -0.0000038 -0.000125 -0.0002213 -0.1088368 0.293362 0.1046256 0.0000169 0.1689935 -0.0469326 -0.0000259 0.0000787 -0.0000361 -0.0704251 0.6350335 -0.2199096 -0.0000402 -0.4966811 0.4367625 0.0000961 -0.0000559 0.000112 0.31158 0.0365945 0.065369 -0.0000092 0.0736134 -0.0562122 0.000006 0.0000175 0.0000278 0.1770893 0.2108782 -0.0773648 0.0000562 0.045533 0.074383 -0.0000204 -0.0000083 0.000147 0.1629799 0.0023829 0.0932653 0.000018 0.1180039 -0.0174102 -0.0000061 -0.0000145 0.0000095 0.156291 -0.1354006 -0.0081246 -0.0000006 -0.0357327 0.0808263 -0.000002 0.0000309 0.0000821 0.1378102 0.12053 0.0200197 -0.0000157 0.0764381 0.2751278 0.000014 -0.0000147 0.0000238 0.3703872 0.3038199 0.0453242 -0.0000108 -0.014257 0.3007566 0.0000246 -0.0000099 0.0000225 0.3458372 -0.1083257 0.0009113 0.0000611 -0.0711942 0.0811358 0.0000018 0.0000451 -0.0000101 0.1282984 0.0546634 -0.0212576 0.0732425 0.1434328 -0.0616775 0.0924407 0.0066161 0.0992767 -0.0743784 0.0545946 -0.0212887 -0.0733056 0.143484 -0.0616699 -0.0924801 -0.0066023 -0.0992965 -0.0743836 unknown
polarizability: 224.058367|-0.2519483|193.4846049|0.035146|-0.0128179|59.2627973 unknown
InChI: InChI=1S/C10H9N3O3/c1-16-8-5-7(11)9-6(3-2-4-12-9)10(8)13(14)15/h2-5H,11H2,1H3
charge 0 multiplicity 1
25 atoms
O  -2.909658 0.477021 0.000093
O  -0.718165 -3.049597 0.002508
O  -2.729893 -2.017595 -0.003599
N  2.679915 0.957672 -0.000085
N  -1.437692 -1.956884 0.00004
N  1.178495 3.139353 -0.000272
C  0.696851 -0.566293 0.000117
C  1.318801 0.736873 -0.000032
C  -0.757724 -0.659142 -0.000002
C  0.50828 1.945126 -0.000184
C  -1.52694 0.558166 -0.000138
C  -0.888765 1.8289 -0.000218
C  1.625489 -1.670116 0.000038
C  3.005461 -1.437244 -0.000077
C  3.505472 -0.106516 -0.000074
C  -3.703369 1.715555 0.000361
H  -1.494983 2.737853 -0.000263
H  1.232633 -2.684481 0.000164
H  3.702279 -2.281086 -0.00013
H  4.580978 0.101104 -0.000097
H  0.701266 4.035717 -0.00039
H  2.201088 3.074146 -0.000232
H  -4.74387 1.362012 0.000559
H  -3.512073 2.31768 -0.907803
H  -3.511679 2.317578 0.908512
