program: Gaussian 09
title: 000024994
version: EM64L-G09RevD.01
frameworkgroup: C1[X(C7H16O3)]
method: RPBEPBE
basis: SDD
operation: Freq
keyword: #pfreq=noraman
keyword: PBEPBE/SDD
title: #p freq=noraman PBEPBE/SDD
converged: YES YES NO NO
title: Mulliken charges:
elementType: O O O C C C C C C C H H H H H H H H H H H H H H H H
charge: -0.295748 -0.264407 -0.276387 -0.483785 0.083180 -0.022940 -0.715978 -0.507986 -0.531654 -0.509837 0.243716 0.217848 0.192908 0.246095 0.216611 0.211397 0.228146 0.199964 0.203849 0.231622 0.202572 0.235382 0.229731 0.228749 0.208037 0.228913
chargesum: 0.00000
title: Mulliken charges with hydrogens summed into heavy atoms:
elementType: O O O C C C C C C C
charge: -0.295748 -0.264407 -0.276387 -0.022221 0.276088 0.223154 -0.059824 0.127449 0.136032 0.155863
polarizability: 9.87605857e+01 -1.08992450e+00 8.58533055e+01 -1.35938475e+00 -2.68726937e-01 7.76569152e+01
1716.lowfreq: -18.1337 -13.1154 0.0007 0.0009 0.0013 7.1533 39.6620 62.6712 69.2588
frequency: 39.6072 62.6225 69.1828 99.8058 124.1667 128.2645 149.4392 194.4155 197.5398 215.3520 238.8286 282.4162 292.2900 319.9391 349.4312 432.8783 514.2960 548.7062 595.4337 741.4272 771.7875 880.0781 901.0682 928.8963 967.6260 1006.8050 1030.5689 1074.6688 1099.3266 1105.2189 1111.8178 1112.9886 1117.7546 1138.7767 1143.9369 1150.5568 1170.7515 1235.6035 1271.3617 1318.1310 1339.6567 1358.4185 1368.5816 1381.0255 1416.4949 1427.6437 1434.4337 1442.6804 1454.2158 1456.5036 1463.5786 1467.0488 1475.7172 1476.1707 1479.2014 1484.2976 2929.7467 2940.8129 2952.7179 2954.1256 2981.2604 3006.0749 3017.1335 3025.9023 3043.3838 3046.0947 3073.1341 3081.2424 3087.6348 3095.3120 3105.2282 3111.2611
redmass: 3.3537 3.0052 2.3398 2.3836 1.3780 2.2730 1.1354 1.2200 1.6507 1.3704 3.5277 2.9369 2.9559 2.6961 3.2040 2.9485 2.9392 3.3357 2.9980 3.2479 3.2946 4.8035 1.7505 2.0207 2.7805 7.3283 5.6841 3.2647 1.8896 1.6620 1.3422 1.3396 1.4989 1.7878 1.3965 1.4803 1.7343 1.4359 1.2868 1.2978 1.2198 1.1519 1.7126 1.2257 1.1277 1.1420 1.1357 1.0922 1.0531 1.0545 1.0563 1.0586 1.0508 1.0505 1.0546 1.0515 1.0356 1.0819 1.0343 1.0341 1.0361 1.1021 1.0642 1.0820 1.0995 1.1000 1.0989 1.1007 1.1002 1.0974 1.1010 1.1010
irintensity: 0.3654 0.9382 5.8128 3.9903 4.0220 0.5038 1.5389 2.5188 10.7319 1.7031 11.7529 6.1590 2.3674 2.7786 5.6775 14.2157 4.1205 7.3109 2.2293 23.5766 18.8704 42.4117 9.8666 11.5056 32.6776 152.2166 35.0812 151.9854 20.7018 23.8444 6.2485 5.5961 18.8920 25.9905 13.4890 12.7758 3.0483 1.8815 3.2762 2.2031 14.1173 9.3837 39.1759 18.3276 4.9526 5.5192 3.1666 14.9151 9.5313 13.3684 5.6264 2.3980 4.1674 12.8154 14.5114 9.8994 72.0680 45.2718 101.6197 27.4272 18.6142 76.2101 6.9596 30.2493 26.0964 73.9208 21.4963 36.7251 39.8602 34.5954 25.0391 27.6641
temp: 298.150 k
press: 1.00000 atm
elementType: 8 8 8 6 6 6 6 6 6 6 1 1 1 1 1 1 1 1 1 1 1 1 1 1 1 1
symmnumber: 1
zpe: 589223.6 jmol-1
zpe.correction: 0.224423 hartree
zpe.thermalcorrener: 0.237944 hartree
zpe.thermalcorrenthalpy: 0.238888 hartree
zpe.thermalcorrgfe: 0.184062 hartree
zpe.sumelectzpe: -501.107784 hartree
zpe.sumelectthermal: -501.094263 hartree
zpe.sumelectthermalent: -501.093319 hartree
zpe.sumelectthermalfe: -501.148145 hartree
dipole: -0.4865 1.2244 0.7717
dipole: 1.5269
quadrupole: -54.5884 -58.4398 -65.7545
quadrupole: -1.6797 -1.0790 -0.9593
quadrupole: 5.0058 1.1544 -6.1602 -1.6797 -1.0790 -0.9593
hfenergy: -501.332207 hartree
pointgroup: C01 [X(C7H16O3)]
dipole: 0.1989992 -0.5132059 0.2406244 debye
dipolederiv: -0.7496723 -0.1885095 -0.1821533 -0.2045386 -0.596811 -0.2686288 -0.1914349 -0.1830731 -0.6402242 -0.6505406 -0.1127586 0.0895648 -0.0046709 -0.8968343 0.2129867 -0.026463 0.2765804 -0.5385896 -1.0990144 0.4063831 -0.0595064 0.2265037 -0.605703 0.0517545 -0.0294778 0.1823229 -0.4859649 -0.2325942 0.0644564 0.0467965 0.0965388 0.021155 -0.0335987 0.0684784 0.0218799 -0.0828057 0.5136688 0.0974624 -0.0219146 0.2122003 0.5778917 0.2442286 0.0441608 0.1215706 0.4102587 1.0762319 -0.1764155 0.0211913 -0.1296468 0.7877924 -0.2550501 0.1024913 -0.59008 0.6909938 -0.123644 0.0881113 0.0983532 0.01689 -0.0451921 -0.1093479 0.0531248 -0.0920162 -0.0272161 0.5340756 0.1205877 0.1480714 0.0104803 0.2138766 -0.0106494 0.1862014 0.1035361 0.5044336 0.3505714 0.0741345 -0.0467471 0.022701 0.5516781 -0.0535141 -0.0038571 0.0872811 0.1627788 0.4861123 -0.1524259 -0.044593 -0.1662596 0.4419565 0.0167291 -0.1964612 0.1063842 0.2449332 0.0750198 -0.0360956 0.0421571 0.0045795 0.0218406 0.1077613 0.0294751 0.1005957 -0.0137829 0.0393825 -0.0580249 -0.0450747 -0.0439865 -0.0799357 -0.1008041 -0.0302408 -0.069168 0.0662326 0.0518214 -0.0135429 0.009148 -0.0544767 -0.0827321 0.0325972 0.0214734 0.1088948 -0.1430672 0.0481331 -0.0099571 -0.0052787 -0.0532277 -0.1246098 -0.0446188 -0.0555001 -0.0240266 -0.0235461 -0.1674278 0.0402374 -0.0624838 0.0193805 0.1048068 0.0118728 -0.1065982 0.0173903 0.0361517 0.0782529 -0.0937334 -0.0179096 -0.0728741 -0.1298167 -0.0766799 -0.0113959 -0.0598539 0.061691 0.0852879 0.0163651 0.0049276 -0.0118102 0.0263873 0.1323236 0.0502244 0.0718339 -0.0789212 -0.228458 0.0409427 0.0107643 0.1402256 0.0577607 -0.0104125 0.0600302 -0.0511036 -0.0057864 0.0052651 -0.0696502 0.0485038 -0.0092117 0.0163982 0.1700765 -0.0172583 0.0615187 -0.1578077 0.0683801 -0.0279028 -0.0310693 -0.0712592 -0.1342695 -0.0898283 -0.0486485 -0.0673559 0.0632379 -0.0981293 0.1337694 0.067325 0.0891026 -0.0896042 -0.041501 0.0645572 -0.1122324 0.0460983 -0.054532 -0.0418013 -0.0913023 0.0031623 0.046847 0.0127427 -0.1384301 -0.0745593 0.0000115 0.067322 -0.0565156 0.0774239 -0.0421206 0.0114604 0.0764148 0.0909292 0.1151101 -0.0704497 -0.1001416 0.0581998 -0.095598 0.0426862 0.0892015 -0.0052861 -0.1257779 0.0170881 0.0063097 0.0030524 -0.0973307 -0.0189645 0.0121326 -0.1828291 -0.0715093 0.0533686 -0.1088614 0.0553184 0.021577 -0.0059857 0.0583682 -0.0325006 -0.0007153 0.1019413 0.157029 0.0403435 -0.0802873 unknown
polarizability: 98.8161654|-1.1805141|85.6771179|0.6557199|1.2374661|77.7775231 unknown
InChI: InChI=1S/C7H16O3/c1-6(8-2)5-7(9-3)10-4/h6-7H,5H2,1-4H3
charge 0 multiplicity 1
26 atoms
O  1.945636 0.979818 0.079649
O  -1.157378 -0.608039 1.137127
O  -2.127103 0.497434 -0.785608
C  0.153194 -0.205874 -0.977769
C  1.519429 -0.388673 -0.298433
C  -0.91768 0.292925 -0.002043
C  2.548314 -1.063865 -1.223584
C  2.999709 1.012493 1.090547
C  -1.603007 -1.960496 0.766851
C  -3.174388 1.218692 -0.047421
H  0.254779 0.540605 -1.785841
H  -0.174849 -1.154263 -1.441032
H  1.390706 -0.985587 0.63301
H  -0.596048 1.226998 0.497521
H  3.536924 -1.150253 -0.737955
H  2.217851 -2.084662 -1.492284
H  2.669302 -0.480281 -2.153793
H  3.961896 0.609966 0.711024
H  2.705954 0.444703 1.999216
H  3.13668 2.073948 1.353235
H  -0.76811 -2.576338 0.375395
H  -2.412252 -1.920138 0.013668
H  -1.977861 -2.412683 1.69869
H  -4.024898 1.310405 -0.740735
H  -2.822819 2.228441 0.247978
H  -3.478883 0.663224 0.859388
