program: Gaussian 09
title: 000267320
version: EM64L-G09RevD.01
frameworkgroup: C1[X(C19H25N5O10S)]
method: RPBEPBE
basis: SDD
operation: Freq
keyword: #p
keyword: freq=noraman
keyword: PBEPBE/SDD
title: #p freq=noraman PBEPBE/SDD
converged: YES YES NO NO
title: Mulliken charges:
elementType: S O O O O O O O O O O N N N N N C C C C C C C C C C C C C C C C C C C H H H H H H H H H H H H H H H H H H H H H H H H H
charge: 0.279366 -0.422320 -0.492201 -0.471233 -0.454102 -0.264180 -0.233075 -0.199516 -0.266466 -0.214636 -0.212995 -0.428857 -0.122523 -0.401001 0.016505 0.014696 -0.057511 -0.158214 -0.582077 -0.121214 -0.157316 0.335612 -0.376452 -0.227967 0.257560 -0.584838 0.247055 0.222896 -0.253323 0.077131 -0.655408 -0.516038 -0.433279 -0.763298 0.444905 0.320588 0.245179 0.263443 0.211972 0.256686 0.414669 0.367707 0.252397 0.222760 0.264309 0.405241 0.245798 0.268362 0.361284 0.305607 0.366565 0.237380 0.231128 0.228978 0.334440 0.292782 0.253599 0.212256 0.247307 0.363880
chargesum: 0.00000
title: Mulliken charges with hydrogens summed into heavy atoms:
elementType: S O O O O O O O O O O N N N N N C C C C C C C C C C C C C C C C C C C
charge: 0.279366 -0.054613 -0.086960 -0.109949 -0.090222 -0.264180 -0.233075 -0.199516 -0.266466 -0.214636 -0.212995 -0.014188 -0.122523 -0.034437 0.016505 0.014696 0.263077 0.086965 -0.318634 0.090757 0.099369 0.335612 0.098705 0.036342 0.257560 -0.070678 0.247055 0.222896 0.052283 0.077131 0.042078 -0.181598 -0.140497 -0.050136 0.444905
polarizability: 4.67806397e+02 8.34951831e-01 3.07805126e+02 -3.35153105e+00 4.66236452e+01 2.24101777e+02
1716.lowfreq: -7.6108 -2.2425 -0.0020 -0.0011 -0.0011 3.0912 11.2341 18.6348 21.9731
frequency: 10.8076 18.4758 21.9576 24.6415 30.5978 35.3281 42.7786 46.2053 56.0195 59.3082 61.4102 63.5569 72.3475 102.8576 108.7681 112.3068 120.5002 121.1841 131.7883 133.0432 159.7412 167.3703 169.1673 173.3854 179.1397 181.1204 228.1819 233.2238 240.5442 243.1150 268.4716 271.6595 278.7098 312.6080 323.0298 338.1333 342.5474 346.2223 346.3381 374.0540 374.8863 382.2527 401.8518 412.8874 426.6698 434.7802 442.5698 462.6145 478.6612 487.4966 493.8594 509.4348 518.4383 559.2433 587.0288 610.8906 615.3546 619.8157 645.7118 655.0565 665.0317 672.0973 698.9748 707.1212 709.2641 716.0437 717.4316 732.4030 743.6877 752.0454 754.4605 780.0314 786.6234 793.1063 809.2698 827.0350 841.0495 843.4341 856.8236 867.5689 876.2295 898.6746 905.4525 958.2811 963.7386 985.5918 993.5323 995.2884 1000.0993 1006.5414 1022.8262 1027.3211 1032.6642 1049.9067 1050.5281 1066.0397 1075.3851 1083.5705 1109.4886 1114.1527 1125.8765 1137.7942 1155.5527 1158.1962 1175.4992 1181.6153 1182.7827 1214.7334 1217.9353 1222.0994 1236.1510 1242.6439 1261.4810 1264.7499 1267.7370 1281.1703 1286.6698 1304.7054 1308.8230 1322.4334 1328.7989 1339.4049 1342.8134 1355.2576 1357.3933 1361.8140 1374.6649 1378.0908 1379.3932 1381.6641 1391.5147 1399.4302 1404.0156 1408.4826 1412.5085 1450.3338 1455.9031 1458.8867 1460.4874 1469.9769 1472.0126 1481.8025 1483.0927 1524.3497 1576.1493 1619.7434 1624.2496 1633.0709 1663.3650 2975.6555 2988.4439 2990.1082 2991.0157 3005.3401 3006.4576 3052.2303 3057.4589 3069.6627 3074.0527 3085.3916 3086.5604 3097.3825 3099.9289 3102.2024 3164.8311 3169.2707 3188.8743 3190.5282 3250.6858 3408.3571 3510.1047 3518.9162 3556.1488 3574.9076
redmass: 5.9119 6.3133 8.6271 6.1500 4.5133 5.5982 6.3138 5.1597 7.7613 6.5515 2.4450 5.3714 6.3293 7.5791 6.1759 4.7763 4.1279 1.3257 4.7332 6.0319 7.2477 5.5670 6.0745 7.4608 7.4235 8.4460 4.8851 2.9161 3.6074 1.4136 4.9516 4.9041 3.7952 5.8770 3.2294 5.2166 1.6461 3.3776 5.8002 10.2833 6.6163 4.9321 4.3200 4.7145 4.5942 2.9189 3.4619 6.2345 1.1753 4.2447 1.6996 5.9961 3.7041 7.3252 4.9855 5.8159 4.9729 5.2185 5.5538 7.6400 6.6369 5.8243 3.2230 7.2004 5.8186 3.1860 3.6414 5.1177 1.2593 6.5969 6.9991 4.0829 2.4214 1.1182 2.6843 3.0117 1.5692 3.2613 3.1462 1.9776 1.3853 3.8435 3.1098 4.2935 1.4089 2.4426 1.8412 2.4118 1.4860 2.2730 2.4639 1.2161 3.0534 1.4638 2.3963 2.3501 2.6233 2.6510 4.1169 3.9413 3.0520 4.9745 1.1907 1.3434 1.8908 2.0566 1.3371 1.9077 2.2355 4.9827 1.4879 1.2527 1.5222 1.7004 1.4139 1.2681 1.3127 1.3936 2.4699 1.8383 1.4561 1.6948 2.3008 1.4400 1.4670 5.1481 1.5921 1.3999 1.8836 1.3413 1.8024 1.2036 1.6226 1.4058 2.5641 1.0440 4.1618 1.1045 1.0819 1.0391 1.0729 2.3537 1.0567 2.9195 5.0545 5.7100 6.9781 9.1943 5.9958 1.0821 1.0363 1.0355 1.0709 1.0831 1.0572 1.0842 1.0854 1.0974 1.1054 1.0991 1.0849 1.1007 1.0974 1.1041 1.0938 1.0898 1.0947 1.0938 1.0803 1.0658 1.0650 1.0770 1.0656 1.0665
irintensity: 1.4762 0.0981 0.9439 1.2289 0.7529 0.3590 1.4592 1.9979 0.1496 0.2724 0.9241 0.7566 0.2410 2.9138 5.7942 22.1282 1.9652 0.2802 5.7218 2.3517 5.0292 1.4532 4.9912 5.7592 1.0898 2.9864 1.0019 0.4096 2.9561 0.1684 0.2145 3.9931 5.1082 3.4507 4.1898 7.2598 49.8784 11.6999 3.9049 16.9256 5.8103 4.2727 10.7663 3.5675 47.2689 5.9343 1.1629 4.4933 461.2630 22.3577 43.5814 2.0104 7.1079 19.9678 5.3459 19.1231 6.6837 0.9517 5.8918 12.5803 24.7905 3.0320 11.7930 7.4055 2.8540 5.6834 24.2960 3.7970 144.1905 14.0151 13.9995 44.0015 71.3180 17.2747 80.6010 12.1876 88.1746 4.8851 25.9848 71.1768 27.1052 29.3860 22.5552 39.9175 23.9012 65.3193 12.4679 16.5194 1.3980 26.5607 45.6505 0.4309 2.2031 5.5082 11.2713 4.9650 55.2779 34.8819 27.0094 15.4666 14.7257 7.8788 45.2492 15.7770 287.2849 186.5421 54.7528 489.0964 211.7996 6.0334 77.2402 1.5526 6.3991 65.4778 69.1086 2.9235 70.1232 62.0184 9.6174 81.1382 93.6637 49.8115 151.4416 15.1412 25.8852 60.6020 28.4047 4.4971 15.6488 19.3631 23.8496 22.6748 58.4267 5.9600 25.6469 11.4869 15.6989 3.3304 12.9228 14.8669 3.9413 21.5516 8.8704 186.9243 148.8075 234.2918 239.8189 371.3847 709.1422 39.1821 20.8501 23.0953 29.2808 47.9160 18.4218 6.1955 22.8423 11.1784 0.9711 17.1867 2.2859 12.7417 10.6381 37.1847 4.0272 7.9591 10.7227 11.5801 231.0326 174.6134 18.8089 66.7963 13.7114 10.5594
temp: 298.150 k
press: 1.00000 atm
elementType: 16 8 8 8 8 8 8 8 8 8 8 7 7 7 7 7 6 6 6 6 6 6 6 6 6 6 6 6 6 6 6 6 6 6 6 1 1 1 1 1 1 1 1 1 1 1 1 1 1 1 1 1 1 1 1 1 1 1 1 1
symmnumber: 1
zpe: 1183769.5 jmol-1
zpe.correction: 0.450874 hartree
zpe.thermalcorrener: 0.486942 hartree
zpe.thermalcorrenthalpy: 0.487886 hartree
zpe.thermalcorrgfe: 0.377949 hartree
zpe.sumelectzpe: -2160.290382 hartree
zpe.sumelectthermal: -2160.254314 hartree
zpe.sumelectthermalent: -2160.253369 hartree
zpe.sumelectthermalfe: -2160.363307 hartree
dipole: 12.2975 5.0193 2.2662
dipole: 13.4743
quadrupole: -259.1567 -232.9533 -206.5684
quadrupole: 26.6909 -1.8739 -14.3995
quadrupole: -26.2639 -0.0605 26.3244 26.6909 -1.8739 -14.3995
hfenergy: -2160.7412555 hartree
pointgroup: C01 [X(C19H25N5O10S1)]
dipole: -4.9272945 -1.4710434 1.2886374 debye
polarizability: 467.5346845|-5.1219005|278.8553466|4.2371953|-61.5214436|253.323269 unknown
InChI: InChI=1S/C19H25N5O10S/c1-3-35-18(22-7-9(2)17(29)21-19(22)30)14(16(28)15(27)13(26)8-25)20-11-5-4-10(23(31)32)6-12(11)24(33)34/h4-7,13-16,18,20-21,25-28H,3,8H2,1-2H3
charge 0 multiplicity 1
60 atoms
S  0.091391 2.146841 1.231339
O  -0.923981 -2.031493 -2.061515
O  -0.762021 -3.030425 0.475039
O  -4.297651 -2.244828 0.377774
O  -2.771377 -4.473203 1.69067
O  -0.746074 2.655127 -1.713813
O  -5.267665 3.822936 -1.923028
O  4.227356 -2.466396 1.791795
O  1.956476 -2.393461 1.665247
O  6.173571 2.068258 -2.043093
O  7.06146 0.453143 -0.691574
N  0.78147 -0.700695 0.019959
N  -2.236478 1.608842 -0.218411
N  -3.023415 3.19265 -1.782675
N  3.14291 -1.964306 1.306518
N  6.05753 1.0735 -1.221657
C  -0.442745 -0.122596 -0.540842
C  -1.456989 -1.23689 -0.955637
C  -1.117951 0.898141 0.44249
C  -1.919618 -2.184887 0.173363
C  -3.178673 -2.992442 -0.252739
C  2.051424 -0.24723 -0.239287
C  -3.143005 -4.437518 0.261669
C  -3.549737 1.479267 0.259876
C  -1.920492 2.500934 -1.273176
C  0.289536 1.300796 2.930683
C  -4.618087 2.176846 -0.249488
C  3.229211 -0.872704 0.336241
C  2.289288 0.877607 -1.109338
C  -4.384467 3.119161 -1.356537
C  1.285949 2.11609 3.766661
C  4.533918 -0.439755 0.010164
C  3.57413 1.298858 -1.431918
C  -6.02789 2.024882 0.263686
C  4.699711 0.627475 -0.876364
H  -0.204284 0.414801 -1.471075
H  -2.345167 -0.731575 -1.372678
H  -1.548714 0.355716 1.301574
H  -2.221976 -1.616171 1.076946
H  -3.278717 -3.003379 -1.356824
H  0.70025 -1.551944 0.609796
H  -0.256035 -2.657032 -1.670956
H  -2.356259 -5.011002 -0.253215
H  -4.117782 -4.93903 0.098221
H  -3.681014 0.757938 1.071023
H  -1.026607 -3.660678 1.205192
H  -0.703468 1.262178 3.413115
H  0.658339 0.275684 2.75534
H  -5.142165 -2.434211 -0.103098
H  1.44092 1.439946 -1.505481
H  -2.820141 3.844054 -2.548498
H  2.272586 2.167137 3.273725
H  0.927403 3.147675 3.930597
H  1.424144 1.640347 4.75466
H  5.397647 -0.938499 0.456572
H  3.737937 2.149544 -2.098251
H  -6.404827 2.986028 0.657701
H  -6.087237 1.267187 1.063488
H  -6.711979 1.737074 -0.554921
H  -3.442071 -3.945814 2.196462
