program: Gaussian 09
title: 000267208
version: EM64L-G09RevD.01
frameworkgroup: C1[X(C17H17BrNO4P)]
method: RPBEPBE
basis: SDD
operation: Freq
keyword: #p
keyword: freq=noraman
keyword: PBEPBE/SDD
title: #p freq=noraman PBEPBE/SDD
converged: YES YES NO NO
title: Mulliken charges:
elementType: Br P O O O O N C C C C C C C C C C C C C C C C C H H H H H H H H H H H H H H H H H
charge: 0.025879 1.381900 -0.494308 -0.539052 -0.146422 -0.568096 -0.904880 0.285945 0.249872 0.284939 0.215427 -0.312489 -0.563968 0.785812 -0.375166 -0.532371 -0.397576 -0.416806 -0.217372 -0.232726 -0.213194 -0.255817 -0.662166 -0.652859 0.324207 0.263471 0.246438 0.363490 0.280371 0.231447 0.236862 0.225009 0.228762 0.243253 0.228698 0.208554 0.242379 0.233867 0.220669 0.221830 0.256187
chargesum: 0.00000
title: Mulliken charges with hydrogens summed into heavy atoms:
elementType: Br P O O O O N C C C C C C C C C C C C C C C C C
charge: 0.025879 1.381900 -0.494308 -0.539052 -0.146422 -0.568096 -0.541390 0.285945 0.249872 0.284939 0.215427 -0.312489 -0.239762 0.785812 -0.111695 -0.532371 -0.151139 -0.136435 0.014076 0.004137 0.240576 0.216134 0.022635 0.045827
polarizability: 4.03141875e+02 2.57016573e+01 2.65128011e+02 -8.84563321e+00 1.37395419e+01 1.41359187e+02
1716.lowfreq: -7.3550 -3.4297 -0.0011 0.0010 0.0013 4.0293 10.2632 19.6151 25.6565
frequency: 8.9956 19.5442 25.5455 38.8831 41.5852 58.6581 66.1025 72.6743 97.7659 109.8089 122.5258 139.5238 142.4307 155.6991 179.7457 191.2475 212.2527 223.3953 236.7945 245.9272 266.2094 279.4408 287.4611 335.2851 343.3412 363.4623 410.9861 419.8033 430.9387 433.3082 441.7162 487.4550 491.2533 530.3687 578.4295 582.2790 598.4844 620.3347 630.4972 655.6231 676.4317 709.7543 718.7081 740.2622 751.9293 779.1525 802.4831 807.8419 813.9680 828.5526 861.4081 869.1868 880.4089 887.5780 898.5069 921.8294 967.7439 982.5202 996.2981 1000.8984 1013.4198 1018.5187 1031.8229 1068.0977 1078.8765 1094.5341 1106.0977 1119.5800 1132.8137 1146.0182 1165.9285 1186.3451 1194.1759 1241.2854 1251.8429 1270.9556 1280.2659 1297.2225 1324.6086 1350.0087 1353.1770 1381.5509 1395.7012 1395.9246 1403.3452 1441.1350 1447.9415 1457.3300 1460.7930 1462.2546 1465.8360 1476.4556 1479.9430 1482.9894 1489.5013 1580.9654 1598.7274 1603.9998 1624.5033 1639.8440 2988.2622 2988.6000 2996.7103 3016.5384 3052.1834 3081.8077 3087.2765 3092.8485 3110.6182 3112.4634 3129.1990 3141.5368 3141.8637 3151.9452 3160.0923 3167.8576 3499.4793
redmass: 5.0847 4.3189 2.9375 3.5529 4.1089 3.7095 2.9883 5.3461 4.0956 9.4466 5.8246 5.3773 3.5536 5.4504 5.0950 2.9272 5.7913 19.7384 1.7717 1.2696 3.2509 5.2441 4.2962 5.8759 5.7600 4.9824 5.4105 3.8458 5.1003 2.9350 5.6209 5.7565 4.0314 6.6927 1.5526 7.6570 5.6191 5.8611 3.9287 6.5511 6.7558 4.5128 6.6650 5.9756 1.6121 2.3842 1.1280 1.0932 7.0368 2.6917 3.8285 4.5549 4.6602 1.4093 1.6308 1.8687 1.4748 4.0024 1.3606 4.6169 2.7257 2.8951 2.1368 11.4841 2.6508 2.1475 2.3068 2.5087 1.4132 1.5640 1.3257 2.0192 2.1981 1.4926 1.1516 1.1170 1.7558 1.9307 3.3671 1.2676 1.2372 4.0098 1.2364 1.2301 2.1810 3.3731 2.6957 1.0394 2.8327 1.1213 1.0773 1.0819 1.0746 3.3990 1.1248 8.0030 7.2170 8.1430 7.8703 10.6071 1.0360 1.0532 1.0389 1.0619 1.1081 1.1015 1.0984 1.0980 1.1053 1.1022 1.0863 1.0927 1.0901 1.0948 1.0928 1.1003 1.0750
irintensity: 1.1929 0.6478 0.9243 0.4346 1.0154 3.3198 0.2499 0.5191 3.4240 0.2851 0.1397 1.3698 6.7635 2.5660 2.6900 8.7427 0.0906 0.5134 1.3336 3.2228 26.1167 0.7101 13.9518 15.3565 6.1793 0.3326 2.6013 8.3752 5.7045 1.2825 22.7379 61.7552 11.3284 6.8331 30.6230 13.3983 14.1419 62.8719 106.0895 5.8882 55.0761 32.6854 51.2571 49.9002 44.7905 38.2680 4.6179 0.5456 45.5189 0.6117 364.1803 39.3619 146.4414 21.1001 1.2397 31.3038 5.9676 57.0075 0.0717 6.3880 163.3575 156.9353 1.2269 121.0730 20.9411 11.2350 21.1034 10.0897 4.5607 8.7690 8.1643 21.9314 11.1228 2.3827 4.4918 0.0745 18.1305 59.2062 172.2111 3.8335 21.3451 47.1310 44.9006 11.9269 0.3216 15.4985 120.5692 8.5234 384.4307 36.9560 23.2230 0.3265 16.2785 73.6691 24.0402 48.6363 80.2252 173.8690 53.1699 71.4761 12.4157 23.9132 21.5289 31.8142 26.2219 13.4965 30.2593 22.6310 30.0528 36.0652 3.3542 2.6089 7.3481 13.1554 2.3913 34.5217 80.9915
temp: 298.150 k
press: 1.00000 atm
elementType: 35 15 8 8 8 8 7 6 6 6 6 6 6 6 6 6 6 6 6 6 6 6 6 6 1 1 1 1 1 1 1 1 1 1 1 1 1 1 1 1 1
symmnumber: 1
zpe: 803919.6 jmol-1
zpe.correction: 0.306197 hartree
zpe.thermalcorrener: 0.330573 hartree
zpe.thermalcorrenthalpy: 0.331517 hartree
zpe.thermalcorrgfe: 0.247544 hartree
zpe.sumelectzpe: -1366.614078 hartree
zpe.sumelectthermal: -1366.589702 hartree
zpe.sumelectthermalent: -1366.588757 hartree
zpe.sumelectthermalfe: -1366.672731 hartree
dipole: 0.4433 3.6299 3.9911
dipole: 5.4131
quadrupole: -111.4796 -165.2590 -162.6193
quadrupole: -3.9626 4.2995 -8.6173
quadrupole: 34.9730 -18.8064 -16.1667 -3.9626 4.2995 -8.6173
hfenergy: -1366.9202747 hartree
pointgroup: C01 [X(C17H17Br1N1O4P1)]
dipole: -0.1688667 1.048657 -1.8458779 debye
polarizability: 397.8885769|-38.6746717|257.3872783|-14.5486384|-37.7532238|154.3532191 unknown
InChI: InChI=1S/C17H17BrNO4P/c1-3-22-24(21,23-4-2)19-16-10-14-13(9-15(16)18)11-7-5-6-8-12(11)17(14)20/h5-10,19H,3-4H2,1-2H3
charge 0 multiplicity 1
41 atoms
Br -0.668141 3.940453 -1.238014
P  -3.288215 0.371288 0.707201
O  -3.205998 -1.11262 -0.174545
O  -4.646894 1.279376 0.128697
O  1.746287 -2.419379 1.063073
O  -3.242007 0.086041 2.264241
N  -2.111795 1.429321 -0.034101
C  2.106289 0.894888 -0.311651
C  1.269956 -0.133023 0.215009
C  3.513971 0.42183 -0.292441
C  3.534574 -0.902411 0.244159
C  2.129353 -1.317984 0.58381
C  -0.114243 0.011342 0.327388
C  -0.723198 1.231052 -0.105889
C  1.531008 2.101924 -0.738148
C  0.129576 2.248846 -0.629778
C  4.712965 1.037418 -0.691684
C  4.730973 -1.620908 0.387907
C  5.927067 0.312886 -0.547248
C  5.941409 -0.999538 -0.01485
C  -3.246768 -1.102298 -1.670809
C  -5.908278 1.20721 0.932258
C  -3.112729 -2.559687 -2.100854
C  -6.630978 -0.127626 0.737771
H  -0.719902 -0.801994 0.742833
H  2.13298 2.918631 -1.146597
H  4.725435 2.051912 -1.104979
H  -2.480037 2.331746 -0.353068
H  4.718967 -2.634571 0.80195
H  6.870441 0.778888 -0.853384
H  6.892181 -1.533557 0.085018
H  -4.205321 -0.657404 -1.997991
H  -2.411604 -0.483092 -2.050917
H  -5.661186 1.381434 1.996045
H  -6.492898 2.056889 0.544281
H  -3.135427 -2.628643 -3.204391
H  -2.160692 -2.985216 -1.741884
H  -3.940497 -3.164145 -1.693773
H  -7.59639 -0.109697 1.277023
H  -6.834949 -0.313915 -0.330977
H  -6.033486 -0.965467 1.138313
