program: Gaussian 09
title: 000267176
version: EM64L-G09RevD.01
frameworkgroup: C1[X(C15H20O3)]
method: RPBEPBE
basis: SDD
operation: Freq
keyword: #pfreq=noraman
keyword: PBEPBE/SDD
title: #p freq=noraman PBEPBE/SDD
converged: YES YES NO NO
title: Mulliken charges:
elementType: O O O C C C C C C C C C C C C C C C H H H H H H H H H H H H H H H H H H H H
charge: -0.252475 -0.292818 -0.265207 -0.431885 -0.350264 -0.148972 -0.373203 -0.684374 -0.215640 0.353571 0.220295 -0.365229 -0.333367 -0.329608 -0.344928 0.179110 -0.217956 -0.675904 0.207749 0.201320 0.212055 0.197497 0.222838 0.219208 0.213608 0.219795 0.212483 0.210106 0.245673 0.255270 0.250145 0.270715 0.267048 0.227654 0.227704 0.228423 0.228484 0.211079
chargesum: 0.00000
title: Mulliken charges with hydrogens summed into heavy atoms:
elementType: O O O C C C C C C C C C C C C C C C
charge: -0.252475 -0.292818 -0.265207 -0.022816 0.059288 0.073866 0.059614 -0.041991 0.030033 0.353571 0.220295 -0.109959 -0.083222 -0.058893 -0.077880 0.179110 0.237403 -0.007919
polarizability: 3.07036585e+02 -2.82391218e-01 1.59409873e+02 -3.80681853e+00 9.24974111e-01 1.05802424e+02
1716.lowfreq: -13.4529 -4.2363 -1.4615 0.0004 0.0009 0.0015 16.2924 26.6153 34.3944
frequency: 15.9966 26.5005 33.9894 44.6314 62.1526 73.6486 79.7709 86.1541 95.8147 117.3037 152.6754 157.4794 209.2005 236.6663 245.5119 248.7748 289.4248 295.0048 309.7008 318.6646 360.7901 416.7912 423.8823 452.9432 494.8507 506.4011 537.3246 624.8884 637.0269 677.3894 736.6747 754.4718 764.0447 789.7009 799.0557 810.1055 823.2949 849.1887 854.9420 873.9517 892.4903 933.0152 964.8146 971.9670 981.8359 990.8726 999.7651 1022.1475 1023.4908 1052.5545 1061.7502 1095.3306 1111.6529 1112.2007 1118.0734 1136.9721 1149.3773 1173.2088 1197.0274 1223.2193 1225.3273 1249.3407 1249.8695 1263.2110 1275.7966 1296.0654 1299.7873 1307.3700 1337.2110 1360.0630 1361.6962 1381.9842 1391.3806 1400.3524 1428.8600 1458.8518 1464.1980 1467.8571 1473.3725 1474.2354 1478.7695 1485.8033 1487.3486 1495.8437 1569.9965 1614.6530 1619.2501 1689.7203 2947.9742 2958.5503 2974.5652 2976.8881 2994.4421 3007.3846 3014.4822 3016.3016 3038.3662 3064.8606 3066.3820 3073.3394 3075.8822 3090.8988 3105.3537 3115.1607 3152.8393 3155.3534 3172.8570 3177.5626
redmass: 4.4271 3.2070 2.7668 2.4925 3.1165 3.0362 3.6980 4.2254 2.5256 3.3078 3.5537 4.1110 3.3067 1.4581 2.0480 1.2945 2.9934 2.5853 4.4627 3.7692 4.2152 2.9856 4.5296 4.4453 5.0966 2.9396 2.8269 6.9005 6.9553 4.1271 1.1227 4.5157 3.3241 2.2055 1.1032 3.4461 1.3455 4.2116 1.6142 1.3842 1.8091 5.7745 1.7456 1.5823 1.0921 1.3441 3.1726 1.5984 2.2708 2.4426 4.8106 2.0337 2.6197 2.2929 1.3628 1.4694 1.7848 1.2762 1.2798 2.3846 1.4470 2.6930 1.2494 1.2816 1.1488 1.2300 1.2869 1.2479 1.4620 1.4151 1.5360 4.1424 1.2133 1.2735 4.1999 1.0891 1.0405 1.1445 1.0608 1.0583 1.0437 1.0741 1.0935 2.3639 8.1084 10.1564 6.6569 6.5996 1.0567 1.0614 1.0367 1.0601 1.0358 1.0581 1.0963 1.1046 1.1010 1.1065 1.0928 1.1005 1.0992 1.0985 1.1025 1.0906 1.0882 1.0878 1.0966 1.0969
irintensity: 0.1562 0.0591 0.0788 0.2141 0.0420 0.8713 0.2271 0.0817 0.6644 0.1891 7.1195 3.3653 2.7496 1.3488 2.4685 1.3047 8.1440 2.0764 1.2191 3.9925 7.3473 0.1008 1.3754 1.4564 2.2529 9.0779 1.0701 6.3341 19.7837 26.0892 8.3349 16.7921 6.5735 6.8803 1.8348 1.8068 8.9523 5.8700 54.4116 7.6693 24.0484 207.6560 6.2607 2.7743 64.2923 0.1443 24.4642 14.4788 23.4433 10.0987 397.9723 11.4235 3.1476 3.0546 5.4050 5.4212 5.0234 298.4616 4.2592 189.6321 28.3419 422.1264 68.5054 1.2892 0.2810 0.4085 0.8072 0.8522 4.9931 23.7723 4.1295 8.1577 12.3311 20.0653 24.6327 4.7486 11.8785 23.3654 4.0346 5.4386 12.8892 15.6356 27.0671 76.9386 76.8457 127.6129 340.3679 14.9704 29.8075 17.3074 57.2016 29.5498 23.5613 25.4224 5.4445 26.1690 14.6236 9.0618 13.0481 94.5050 50.0129 35.1148 47.1361 22.5072 0.7162 11.2329 7.7843 5.7527
temp: 298.150 k
press: 1.00000 atm
elementType: 8 8 8 6 6 6 6 6 6 6 6 6 6 6 6 6 6 6 1 1 1 1 1 1 1 1 1 1 1 1 1 1 1 1 1 1 1 1
symmnumber: 1
zpe: 827135.2 jmol-1
zpe.correction: 0.315039 hartree
zpe.thermalcorrener: 0.334783 hartree
zpe.thermalcorrenthalpy: 0.335727 hartree
zpe.thermalcorrgfe: 0.263254 hartree
zpe.sumelectzpe: -807.883947 hartree
zpe.sumelectthermal: -807.864204 hartree
zpe.sumelectthermalent: -807.863259 hartree
zpe.sumelectthermalfe: -807.935732 hartree
dipole: -3.0900 3.4622 -0.2339
dipole: 4.6464
quadrupole: -92.1636 -107.5223 -108.6139
quadrupole: 10.7973 -1.0029 1.3678
quadrupole: 10.6030 -4.7557 -5.8473 10.7973 -1.0029 1.3678
hfenergy: -808.1989861 hartree
pointgroup: C01 [X(C15H20O3)]
dipole: 1.1907014 -0.9160476 -1.041566 debye
polarizability: 306.795384|3.347963|136.28782|-7.0875104|26.4910003|129.1656774 unknown
InChI: InChI=1S/C15H20O3/c1-3-5-6-7-12-18-14-10-8-13(9-11-14)15(16)17-4-2/h6-11H,3-5,12H2,1-2H3
charge 0 multiplicity 1
38 atoms
O  1.382404 0.802225 0.390779
O  -4.832818 -0.717869 -0.246118
O  -5.007511 0.891863 1.432887
C  6.113817 0.103451 -0.010031
C  7.049377 -0.651533 -0.994582
C  4.667693 -0.321005 -0.126737
C  2.210829 0.033961 -0.578373
C  8.53001 -0.252077 -0.819547
C  3.630394 0.501407 -0.430198
C  0.001226 0.593427 0.375736
C  -2.815407 0.325624 0.523617
C  -0.740557 1.383609 1.295076
C  -0.666633 -0.332346 -0.470168
C  -2.133404 1.2481 1.365943
C  -2.067679 -0.458727 -0.389762
C  -4.292009 0.224554 0.640716
C  -6.315098 -0.877702 -0.192322
C  -6.682482 -1.934083 -1.229728
H  6.203636 1.194521 -0.176373
H  6.469147 -0.092997 1.023869
H  6.722473 -0.446459 -2.032661
H  6.936495 -1.743591 -0.839315
H  4.463906 -1.391473 0.043972
H  2.12127 -1.050764 -0.368142
H  1.823146 0.236598 -1.59932
H  9.179479 -0.792703 -1.53181
H  8.6712 0.831891 -0.989131
H  8.884808 -0.480587 0.203199
H  3.803599 1.573921 -0.592814
H  -0.199785 2.087368 1.934597
H  -0.111995 -0.952486 -1.179773
H  -2.721417 1.847864 2.068128
H  -2.593279 -1.168286 -1.035044
H  -6.597598 -1.175284 0.833986
H  -6.77993 0.102795 -0.402542
H  -6.193411 -2.896926 -1.002431
H  -6.375744 -1.616986 -2.241284
H  -7.776555 -2.091898 -1.231698
