program: Gaussian 09
title: 000267175
version: EM64L-G09RevD.01
frameworkgroup: C1[X(C13H13NO3)]
method: RPBEPBE
basis: SDD
operation: Freq
keyword: #p
keyword: freq=noraman
keyword: PBEPBE/SDD
title: #p freq=noraman PBEPBE/SDD
converged: YES YES NO NO
title: Mulliken charges:
elementType: O O O N C C C C C C C C C C C C C H H H H H H H H H H H H H
charge: -0.220821 -0.458623 -0.275944 -0.369519 -0.302905 -0.598333 0.171202 0.440263 0.251827 0.096126 -0.391781 -0.386508 -0.810824 0.057409 -0.232322 -0.256948 -0.243054 0.292445 0.270140 0.261753 0.331555 0.263368 0.248889 0.321280 0.242000 0.235260 0.224485 0.227230 0.228830 0.383521
chargesum: 0.00000
title: Mulliken charges with hydrogens summed into heavy atoms:
elementType: O O O N C C C C C C C C C C C C C
charge: -0.220821 -0.075101 -0.275944 -0.037964 -0.010460 -0.066441 0.171202 0.440263 0.251827 0.096126 -0.128413 -0.137619 -0.012284 0.057409 -0.007837 -0.029718 -0.014224
polarizability: 1.61044113e+02 -3.98786095e+00 1.88311089e+02 -2.47442432e+00 5.63964402e+00 1.11480913e+02
1716.lowfreq: -7.2876 -3.5965 0.0003 0.0006 0.0010 8.8046 25.2316 35.3453 59.3815
frequency: 25.1678 35.1559 59.3373 62.9736 93.0659 103.0865 166.2017 197.9993 213.4293 232.4662 316.9826 328.6306 343.5344 357.1602 402.9383 410.4484 462.5233 481.4474 530.5691 547.9919 571.1754 584.2185 602.7570 617.4274 628.1069 692.3239 707.4506 712.9851 735.1573 735.7271 757.4970 788.4033 859.4203 873.7251 928.6696 958.7406 979.5942 983.2322 989.6502 994.7546 998.1950 1028.1957 1045.0189 1052.4747 1090.0954 1118.1805 1132.5116 1159.8253 1174.2509 1202.5771 1214.3063 1244.2580 1265.7296 1288.3369 1297.5864 1313.7970 1332.8497 1353.5989 1382.3265 1396.5952 1429.2576 1437.9773 1443.1940 1458.9216 1485.6312 1491.6375 1590.1282 1610.9835 1612.7230 1631.3203 1647.6325 2974.3561 2991.5222 3049.6027 3052.6584 3088.9286 3122.9207 3131.8896 3134.8669 3146.1700 3154.3430 3165.4152 3507.5889 3523.7028
redmass: 4.1837 1.0943 4.4124 5.7259 7.8090 6.0868 4.0779 5.2452 4.7640 4.3420 3.9669 3.2256 4.9590 5.5719 2.8801 7.6538 3.3960 3.9729 3.2260 4.4581 2.8535 1.8267 3.6634 5.7385 2.4059 4.7087 1.9168 2.2484 2.0974 3.4822 2.9296 2.7389 1.2431 3.3188 1.4635 2.4144 4.5433 1.4005 4.0761 2.4803 1.3278 2.2586 1.8795 1.5542 1.7219 3.3887 1.6763 1.7979 1.0565 1.1351 1.4382 2.5244 2.2232 1.7243 2.1301 3.5970 1.4728 1.4794 5.3309 1.2218 1.6988 1.7935 1.2121 1.2863 2.1577 1.0480 5.8311 6.3313 5.9938 8.6918 5.1921 1.0403 1.0666 1.0965 1.0844 1.0944 1.0845 1.0882 1.0965 1.0924 1.0952 1.1011 1.0767 1.0640
irintensity: 0.0694 0.3339 0.0262 3.9057 2.1743 0.1513 0.5515 0.0534 5.9190 0.3527 1.8324 0.6501 4.0072 4.5724 0.2754 18.6045 9.0506 5.7668 4.2439 44.4011 5.8424 81.7542 9.5304 2.1292 45.4080 7.8271 45.5429 42.5043 33.2042 76.5315 12.0499 18.2454 0.3011 4.8334 1.9078 41.2177 233.2373 2.6408 55.4503 4.3117 0.9938 5.9217 14.5953 6.0453 9.5124 36.7491 137.0238 32.2940 0.5161 1.3901 2.6276 105.3050 15.9975 5.1857 97.7577 78.2669 14.2585 11.8428 1.7607 40.6201 123.2911 31.1720 21.2936 4.4048 22.0964 18.8867 3.6793 374.0856 192.6673 172.1679 111.2080 25.3956 12.5947 13.9891 2.2410 7.0922 0.6483 8.9655 5.1732 18.6977 17.1945 22.1607 40.8538 49.6168
temp: 298.150 k
press: 1.00000 atm
elementType: 8 8 8 7 6 6 6 6 6 6 6 6 6 6 6 6 6 1 1 1 1 1 1 1 1 1 1 1 1 1
symmnumber: 1
zpe: 616353.2 jmol-1
zpe.correction: 0.234757 hartree
zpe.thermalcorrener: 0.249964 hartree
zpe.thermalcorrenthalpy: 0.250908 hartree
zpe.thermalcorrgfe: 0.190793 hartree
zpe.sumelectzpe: -782.409580 hartree
zpe.sumelectthermal: -782.394373 hartree
zpe.sumelectthermalent: -782.393428 hartree
zpe.sumelectthermalfe: -782.453543 hartree
dipole: 0.5803 -1.1758 0.4014
dipole: 1.3713
quadrupole: -95.5393 -106.8553 -94.5159
quadrupole: 7.0678 -2.1205 7.9171
quadrupole: 3.4308 -7.8851 4.4543 7.0678 -2.1205 7.9171
hfenergy: -782.6443365 hartree
pointgroup: C01 [X(C13H13N1O3)]
dipole: 0.1073718 -0.5174446 0.1085364 debye
polarizability: 160.7743559|2.6412787|186.5741088|0.3437745|13.7840842|113.4876507 unknown
InChI: InChI=1S/C13H13NO3/c1-8-12(13(16)17)10(7-11(15)14-8)9-5-3-2-4-6-9/h2-6,10,14,16H,7H2,1H3
charge 0 multiplicity 1
30 atoms
O  1.346951 3.422822 -0.051286
O  0.619667 -2.653282 -1.562638
O  2.0679 -3.029233 0.197699
N  1.856843 1.325822 0.795183
C  0.228349 0.053266 -1.115261
C  0.841405 1.434912 -1.438089
C  1.219177 -0.749592 -0.244984
C  -1.161202 0.127405 -0.44067
C  1.948228 -0.078541 0.725935
C  1.335218 2.170454 -0.20129
C  -1.943863 -1.0558 -0.349159
C  -1.698366 1.329242 0.089124
C  2.855641 -0.675582 1.77653
C  1.371064 -2.196397 -0.447777
C  -3.213238 -1.042473 0.266304
C  -2.97075 1.343531 0.707598
C  -3.732646 0.158918 0.803486
H  0.103234 -0.4915 -2.065764
H  0.135374 2.091775 -1.971566
H  1.721043 1.293022 -2.098347
H  2.276633 1.803021 1.599411
H  -1.55212 -1.985923 -0.773989
H  -1.145959 2.272029 0.018784
H  2.954681 -1.759636 1.638117
H  2.438566 -0.485971 2.785448
H  3.857804 -0.208236 1.735339
H  -3.799693 -1.966812 0.321551
H  -3.36509 2.284029 1.108955
H  -4.718919 0.171901 1.280734
H  0.790767 -3.629069 -1.654274
