program: Gaussian 09
title: 000267171
version: EM64L-G09RevD.01
frameworkgroup: C1[X(C14H18O3)]
method: RPBEPBE
basis: SDD
operation: Freq
keyword: #pfreq=noraman
keyword: PBEPBE/SDD
title: #p freq=noraman PBEPBE/SDD
converged: YES YES NO NO
title: Mulliken charges:
elementType: O O O C C C C C C C C C C C C C C H H H H H H H H H H H H H H H H H H
charge: -0.264071 -0.447672 -0.260764 -0.277045 0.374145 -0.730308 -0.179654 0.165040 -0.499148 0.256354 -0.340779 -0.164635 -0.351684 -0.444789 -0.671587 0.085007 -0.537012 0.238079 0.230956 0.210970 0.225089 0.240368 0.272837 0.242241 0.218525 0.272809 0.209238 0.202174 0.208471 0.215109 0.223153 0.225096 0.226690 0.246062 0.380734
chargesum: 0.00000
title: Mulliken charges with hydrogens summed into heavy atoms:
elementType: O O O C C C C C C C C C C C C C C
charge: -0.264071 -0.066938 -0.260764 -0.038965 0.374145 -0.063293 0.060715 0.165040 -0.226311 0.256354 -0.098538 0.053891 -0.078875 -0.033377 -0.024854 0.085007 0.160836
polarizability: 2.26455705e+02 2.11644878e+01 1.69843941e+02 1.43788237e+01 -5.53800712e+00 1.15967102e+02
1716.lowfreq: -6.5638 -5.2524 -0.0008 -0.0004 0.0006 2.8262 15.4892 29.0695 58.6224
frequency: 15.3817 28.9676 58.6176 66.6653 83.1591 105.4385 119.3774 132.8100 139.8549 170.5196 176.8966 218.9195 231.2900 249.3400 261.1571 274.6851 294.1306 321.7584 339.7880 367.9752 426.0906 469.9349 490.2700 494.1247 529.7968 544.2145 583.9285 593.3644 610.2140 679.2757 717.2054 734.9658 762.1596 778.6371 825.8433 833.1469 861.1038 897.4893 913.5483 948.1543 965.5248 966.6064 984.2155 1012.0758 1025.4413 1042.0265 1059.5420 1069.2927 1110.0153 1112.7711 1118.8413 1144.1846 1156.9735 1163.1015 1188.9740 1223.9447 1236.9282 1253.9457 1265.9471 1286.0874 1301.5621 1314.0027 1325.6057 1339.1373 1385.8175 1387.3016 1392.0517 1429.7416 1436.9992 1463.8434 1467.9581 1469.5658 1471.4953 1474.7106 1483.4231 1484.4025 1489.3259 1576.6947 1614.0911 1641.0357 1677.9123 2963.3155 2966.5958 2975.8853 2979.6140 3021.7925 3025.1089 3058.1635 3065.0955 3069.8796 3074.6219 3078.0397 3082.7158 3085.0673 3127.8496 3157.7491 3159.3698 3180.7111 3533.8635
redmass: 4.4180 3.5252 5.8777 2.9477 3.2221 2.7053 3.4412 4.3171 3.9510 2.4657 2.1572 1.3410 1.1739 1.5817 2.1712 2.9202 2.9614 4.0673 4.2974 3.4388 2.9241 4.6232 3.6047 3.4313 4.1901 1.9583 4.0437 3.4267 1.9473 5.2800 4.1201 3.9939 2.5549 1.4992 1.5525 1.9424 3.6966 1.6035 2.0629 1.4770 1.1287 1.3266 8.6027 2.1368 2.2009 2.6756 1.9757 1.7503 1.3241 2.0356 2.2285 1.4414 2.0808 1.6653 1.5328 1.3745 3.6531 1.2209 1.3740 1.2651 1.3240 1.4562 2.4874 1.4271 1.2367 1.4897 2.9016 3.0255 1.3310 1.0734 1.0527 1.1515 1.0484 1.0436 1.1652 1.0770 1.8561 8.1385 6.2486 8.3676 6.7567 1.0619 1.0325 1.0355 1.0356 1.0846 1.0967 1.1043 1.0938 1.0972 1.0982 1.0923 1.0991 1.0998 1.1000 1.0878 1.0908 1.0964 1.0641
irintensity: 0.4429 0.3022 1.0313 1.4226 0.5429 0.5175 3.1134 1.4586 1.3393 1.3584 1.1159 0.5757 0.2491 2.1500 1.4687 1.3497 2.1168 1.9505 0.6397 0.7711 1.2227 4.4190 7.2586 11.7547 51.1243 49.7704 19.9144 23.1967 69.6268 2.0693 39.7908 12.4963 14.0935 8.2853 30.6190 6.2534 19.3398 3.7192 36.2214 11.3408 60.4350 5.9776 53.4347 66.1083 60.4402 35.1700 122.0902 7.4109 13.3390 112.1915 4.7722 22.9184 48.4901 43.4913 6.7136 8.1740 170.3698 15.8333 35.8865 1.3814 2.7549 12.1788 102.8903 2.1856 4.7936 15.4867 14.6627 13.7322 15.4436 8.3524 15.6781 57.8642 21.6297 11.7271 10.3445 11.3029 59.7844 18.6337 131.5371 291.7882 0.5378 45.8171 63.4163 45.0044 24.2435 3.8034 7.1249 40.1981 2.7253 20.3185 2.8850 100.6908 57.7524 40.9545 18.9055 7.5920 1.4398 5.1081 47.2918
temp: 298.150 k
press: 1.00000 atm
elementType: 8 8 8 6 6 6 6 6 6 6 6 6 6 6 6 6 6 1 1 1 1 1 1 1 1 1 1 1 1 1 1 1 1 1 1
symmnumber: 1
zpe: 753460.5 jmol-1
zpe.correction: 0.286978 hartree
zpe.thermalcorrener: 0.305301 hartree
zpe.thermalcorrenthalpy: 0.306245 hartree
zpe.thermalcorrgfe: 0.238991 hartree
zpe.sumelectzpe: -768.666467 hartree
zpe.sumelectthermal: -768.648144 hartree
zpe.sumelectthermalent: -768.647200 hartree
zpe.sumelectthermalfe: -768.714453 hartree
dipole: 1.9612 3.8149 -0.1935
dipole: 4.2939
quadrupole: -97.0127 -93.8734 -101.5056
quadrupole: -2.4888 3.1031 1.0551
quadrupole: 0.4512 3.5905 -4.0417 -2.4888 3.1031 1.0551
hfenergy: -768.9534445 hartree
pointgroup: C01 [X(C14H18O3)]
dipole: 0.496887 -1.3163163 0.9350437 debye
polarizability: 219.4808162|-28.3602222|156.4962639|9.3514866|-31.0398348|136.2896681 unknown
InChI: InChI=1S/C14H18O3/c1-4-5-6-10(2)12-9-11(14(15)16)7-8-13(12)17-3/h5-10,15H,4H2,1-3H3
charge 0 multiplicity 1
35 atoms
O  0.849267 -2.181485 0.359938
O  -4.70397 1.045338 0.221191
O  -3.503214 2.316186 -1.306705
C  1.249754 -0.06031 -1.418765
C  -0.104782 -0.277769 -0.732039
C  1.122707 0.55744 -2.83445
C  2.132264 0.815428 -0.530353
C  -0.269056 -1.356872 0.195678
C  -1.203495 0.576637 -0.932299
C  -2.435573 0.390519 -0.247605
C  -1.49251 -1.558197 0.884294
C  3.303668 0.423854 0.032947
C  -2.572414 -0.683707 0.66378
C  4.183308 1.290051 0.91148
C  4.377251 0.6906 2.328932
C  -3.538606 1.337723 -0.517557
C  0.752834 -3.304664 1.297617
H  1.739764 -1.046793 -1.509273
H  2.115494 0.58543 -3.316975
H  0.746252 1.596377 -2.800656
H  0.438625 -0.034094 -3.470174
H  1.760794 1.83891 -0.357291
H  -1.133656 1.413566 -1.634188
H  -1.608622 -2.387765 1.587247
H  3.650887 -0.608796 -0.134041
H  -3.520838 -0.82613 1.188663
H  3.748005 2.304754 0.991015
H  5.180241 1.40731 0.437536
H  4.822301 -0.320713 2.273253
H  5.047374 1.323265 2.939905
H  3.408237 0.604778 2.852672
H  -0.03379 -4.019478 0.988699
H  0.553692 -2.950127 2.326719
H  1.73669 -3.794219 1.257161
H  -5.394982 1.721459 -0.011555
