program: Gaussian 09
title: 000267157
version: EM64L-G09RevD.01
frameworkgroup: C1[X(C14H16BrNO3)]
method: RPBEPBE
basis: SDD
operation: Freq
keyword: #p
keyword: freq=noraman
keyword: PBEPBE/SDD
title: #p freq=noraman PBEPBE/SDD
converged: YES YES NO NO
title: Mulliken charges:
elementType: Br O O O N C C C C C C C C C C C C C C H H H H H H H H H H H H H H H H
charge: 0.070143 -0.217156 -0.182349 -0.170883 0.140398 -0.328503 -0.469241 -0.465170 0.287824 -0.629277 -0.197695 -0.227621 0.516331 -0.686874 -0.395156 -0.384790 -0.227543 -0.256837 -0.239908 0.242777 0.247854 0.266347 0.267218 0.249334 0.262221 0.247386 0.331351 0.239677 0.270811 0.281910 0.246004 0.224219 0.229919 0.226139 0.231141
chargesum: 0.00000
title: Mulliken charges with hydrogens summed into heavy atoms:
elementType: Br O O O N C C C C C C C C C C C C C C
charge: 0.070143 -0.217156 -0.182349 -0.170883 0.140398 -0.085727 0.044960 0.051382 0.287824 -0.119669 0.133656 -0.227621 0.516331 0.105525 -0.149152 -0.160571 0.002376 -0.030698 -0.008768
polarizability: 1.82935908e+02 -6.04129492e+00 1.97459121e+02 8.10295476e+00 -9.03529527e+00 1.62823275e+02
1716.lowfreq: -5.4527 -0.0004 -0.0003 0.0005 6.4026 10.5358 25.2914 34.4902 41.1593
frequency: 25.1625 34.4596 41.0665 42.5368 57.3565 67.5074 78.3667 96.5354 150.9382 164.1385 191.8092 205.7835 231.1988 239.7046 264.3919 267.5947 276.0895 291.0076 312.0615 342.1703 410.7250 438.0281 482.8799 518.1848 524.6558 561.5366 596.4372 616.3454 627.9069 657.5037 699.3933 710.7226 754.3751 766.1674 775.2095 783.6478 796.6958 814.8537 855.7548 859.0015 881.8591 902.3774 929.2753 963.1248 979.1705 992.5360 998.0768 1022.8118 1032.1580 1044.6546 1066.6590 1074.9455 1079.0468 1084.6307 1089.5435 1091.3834 1111.8629 1174.0061 1179.0765 1185.3761 1192.9016 1198.6274 1200.8211 1203.9303 1216.6036 1282.2270 1304.6301 1331.7383 1353.9203 1382.2071 1386.7748 1395.1530 1411.2327 1425.6299 1438.9799 1444.8123 1447.1606 1460.7043 1464.5027 1485.5144 1593.5547 1613.6073 1617.9981 2980.6447 3004.4449 3036.1123 3051.4766 3102.2560 3105.0641 3108.4848 3117.9039 3129.2640 3137.5825 3140.3368 3140.5699 3151.0428 3166.1603 3208.7721 3227.3690
redmass: 5.0105 8.4872 4.1302 11.2469 4.4142 4.2161 5.9612 4.7968 9.9220 7.5618 5.4816 4.5622 3.5116 3.0055 2.4253 2.1560 2.0190 3.8984 3.8581 3.5022 2.8372 4.2356 5.6922 4.1746 3.2910 3.2292 4.3648 6.2311 4.5145 4.0179 3.9540 1.6892 3.7490 4.1075 1.6715 3.3429 2.1916 1.8356 1.2441 1.3878 2.8231 4.5909 1.4721 2.6183 1.3885 5.7791 1.3341 2.9948 1.9980 1.5379 1.7990 1.6833 1.6006 1.2306 1.5598 1.1780 1.9695 1.0609 1.3662 1.6703 2.3558 1.9104 2.2061 1.8723 2.1395 1.5274 1.5217 1.3368 1.3781 2.0476 4.7474 1.6825 2.6262 1.0871 1.3476 1.7163 1.3205 1.0683 1.0558 2.2437 5.9236 6.1361 7.6840 1.0628 1.0398 1.0892 1.0879 1.0500 1.0943 1.0612 1.0860 1.0868 1.0997 1.0917 1.0923 1.0961 1.1015 1.1184 1.1163
irintensity: 0.5657 0.5427 2.4271 0.8733 0.5041 0.1039 2.0454 0.1194 2.9667 0.8204 0.3635 2.3653 0.2908 1.3099 10.8838 0.9115 1.9791 3.2747 6.7002 2.8821 0.0861 13.0754 4.0940 17.5124 25.9973 14.4936 4.4304 0.4189 1.1172 0.6537 4.9893 61.6613 25.9868 20.2092 39.9096 1.7093 5.6418 4.4060 0.2548 1.1314 3.6084 15.5350 0.5564 24.1204 1.0351 2.4022 0.0745 33.0198 33.9149 21.2218 38.2661 62.9725 39.5704 8.5802 9.0630 0.8047 42.2182 0.1470 1.5987 12.8226 33.0726 41.1754 54.9679 25.8401 14.2697 36.4339 7.0215 9.7350 4.2875 140.5274 15.6308 98.2064 26.7676 11.9124 15.5617 27.8520 13.2235 23.4035 7.1774 11.6211 1.5590 1.4039 58.0859 17.8272 6.9489 6.0478 6.5629 12.8318 10.5827 9.6872 9.8892 0.6928 4.3277 3.8622 24.6691 29.3497 16.2302 0.3504 9.0570
temp: 298.150 k
press: 1.00000 atm
elementType: 35 8 8 8 7 6 6 6 6 6 6 6 6 6 6 6 6 6 6 1 1 1 1 1 1 1 1 1 1 1 1 1 1 1 1
symmnumber: 1
zpe: 712814.0 jmol-1
zpe.correction: 0.271497 hartree
zpe.thermalcorrener: 0.290625 hartree
zpe.thermalcorrenthalpy: 0.291570 hartree
zpe.thermalcorrgfe: 0.221175 hartree
zpe.sumelectzpe: -835.441698 hartree
zpe.sumelectthermal: -835.422569 hartree
zpe.sumelectthermalent: -835.421625 hartree
zpe.sumelectthermalfe: -835.492019 hartree
dipole: 2.9539 2.5059 3.9253
dipole: 5.5148
quadrupole: -115.7722 -124.6097 -117.3287
quadrupole: -9.7962 7.1962 -2.6479
quadrupole: 3.4646 -5.3729 1.9082 -9.7962 7.1962 -2.6479
hfenergy: -835.7131943 hartree
pointgroup: C01 [X(C14H16Br1N1O3)]
dipole: -0.9005513 1.3618525 -1.4289641 debye
polarizability: 186.7395406|7.9206037|192.4372977|10.5851942|9.2659732|164.0414657 unknown
InChI: InChI=1S/C14H16BrNO3/c1-14(15,16(18)19)12(9-13(17)11-7-8-11)10-5-3-2-4-6-10/h2-6,11-12H,7-9H2,1H3
charge 0 multiplicity 1
35 atoms
Br 3.340944 -1.178439 0.478077
O  -1.899849 0.034229 1.447249
O  1.403908 -3.71397 -1.305353
O  0.708796 -3.187437 0.795597
N  1.209819 -2.884742 -0.344731
C  -3.404333 -0.348481 -0.398841
C  -4.428619 0.745078 0.020541
C  -4.62694 -0.676498 0.501991
C  -2.05773 -0.315387 0.244353
C  -0.878838 -0.764292 -0.636205
C  0.491274 -0.479353 0.038431
C  1.60207 -1.365283 -0.595574
C  0.83358 1.015264 0.034474
C  1.937518 -1.157385 -2.066708
C  1.224374 1.637029 1.246839
C  0.748218 1.812905 -1.136384
C  1.539634 3.012306 1.288195
C  1.061876 3.189729 -1.099608
C  1.462929 3.79469 0.113134
H  -3.438788 -0.692704 -1.437055
H  -5.078871 1.138207 -0.765403
H  -4.060831 1.475427 0.74644
H  -4.390939 -0.88966 1.548093
H  -5.41796 -1.285449 0.056451
H  -1.030593 -1.84849 -0.819274
H  -0.968117 -0.273168 -1.62311
H  0.395109 -0.800364 1.090794
H  1.03849 -1.303686 -2.693075
H  2.3130 -0.131748 -2.203409
H  2.705043 -1.870034 -2.4011
H  1.271961 1.03881 2.163041
H  0.424765 1.370996 -2.086602
H  1.836658 3.473425 2.23652
H  0.989742 3.788852 -2.014309
H  1.705102 4.86282 0.143623
