program: Gaussian 09
title: 000267134
version: EM64L-G09RevD.01
frameworkgroup: C1[X(C12H17N3O2)]
method: RPBEPBE
basis: SDD
operation: Freq
keyword: #p
keyword: freq=noraman
keyword: PBEPBE/SDD
title: #p freq=noraman PBEPBE/SDD
converged: NO YES NO NO
title: Mulliken charges:
elementType: O O N N N C C C C C C C C C C C C H H H H H H H H H H H H H H H H H
charge: -0.312065 -0.263843 0.080860 -0.407129 -0.645123 -0.218781 -0.417194 0.340661 0.168468 -0.268531 -0.688956 -0.385050 -0.348538 -0.261160 -0.224056 -0.544248 0.305112 0.270439 0.184806 0.212838 0.198149 0.234565 0.220342 0.208874 0.225067 0.241331 0.222644 0.225441 0.225184 0.301117 0.204552 0.267291 0.303043 0.343890
chargesum: 0.00000
title: Mulliken charges with hydrogens summed into heavy atoms:
elementType: O O N N N C C C C C C C C C C C C
charge: -0.312065 -0.263843 0.080860 -0.139838 0.001810 0.051658 -0.019550 0.340661 0.168468 -0.070382 -0.025174 -0.159983 -0.107207 -0.038516 0.001385 0.186604 0.305112
polarizability: 1.96216781e+02 3.67911937e-01 1.57805597e+02 1.48281231e+01 1.31112838e+01 1.38188332e+02
1716.lowfreq: -11.9305 -5.8240 -0.7895 -0.0008 -0.0007 -0.0007 23.1799 34.4294 48.9841
frequency: 23.0300 34.1823 48.9700 65.0936 74.9185 99.8298 112.2524 132.1829 138.6091 170.5384 171.8703 184.1622 213.7979 239.5199 270.4873 298.0530 315.6447 349.6407 361.3149 397.2656 445.8494 484.2142 486.8442 498.7056 508.6217 556.2791 565.3833 582.3652 595.2503 653.6921 705.4801 713.4091 754.5482 764.2028 777.4970 824.3359 865.6158 897.3671 920.5205 938.1084 941.2125 949.2653 977.9532 1022.7166 1031.1857 1045.1809 1060.8871 1068.4720 1091.3122 1112.0554 1125.5331 1139.0654 1145.6829 1167.6148 1178.7945 1214.2504 1239.3160 1255.5635 1282.5105 1288.8618 1312.2890 1333.5356 1344.2824 1376.1190 1391.4394 1426.1223 1442.2611 1459.4155 1471.2662 1474.0903 1475.1327 1486.0512 1490.9797 1502.2701 1581.9500 1600.1028 1600.9259 1609.8762 1673.3335 2945.0902 2965.3892 2966.9305 2981.2512 3015.3411 3044.8163 3070.5543 3075.9479 3082.2034 3114.4909 3118.7699 3128.8422 3144.3558 3161.4186 3381.9097 3537.0659 3693.3541
redmass: 6.2698 4.6314 4.8572 3.2868 3.2698 2.9693 3.7293 3.6020 3.5024 2.2962 1.6501 1.1083 3.1467 1.7478 4.1196 3.6442 4.4351 2.1435 2.1130 3.1510 3.9780 3.8330 3.9826 1.2360 3.3469 1.4841 2.5474 3.5841 3.8770 5.4423 6.3882 3.0814 2.4535 1.6810 2.6484 1.6540 1.4730 1.7611 2.0334 1.7849 2.4907 3.1160 1.3157 3.0119 2.2113 2.2515 1.8172 2.5049 3.0176 1.2694 2.5215 2.3473 1.3535 1.1404 1.7606 3.1534 1.4158 1.3391 1.3822 1.8542 1.4104 1.4757 1.6095 4.6583 1.2103 1.4995 1.5945 1.0801 1.4348 1.0420 1.4820 1.0700 1.0656 1.8159 6.5986 2.9272 1.7816 5.4749 4.9024 1.0861 1.0334 1.0599 1.0362 1.0966 1.0859 1.1036 1.0998 1.1001 1.0864 1.1026 1.0879 1.0936 1.1006 1.0753 1.0458 1.1036
irintensity: 2.7586 0.4448 17.4348 3.8801 2.9187 8.3035 3.9788 3.1225 6.3536 17.1799 0.3418 0.8215 4.6263 2.9539 0.8777 3.4366 3.1520 29.3395 38.7997 27.7077 4.5859 14.5434 52.0066 180.0528 9.2492 82.8783 22.2211 2.6433 4.2007 7.9435 10.4885 25.9913 18.5080 33.6762 28.4792 2.1534 1.4032 3.1195 40.3663 5.8644 24.3380 26.9196 0.1366 5.4730 14.3852 16.0165 12.5614 13.0871 66.1600 9.1487 90.3077 13.8003 0.1855 0.4351 18.2861 60.3160 8.2290 1.4271 10.1594 339.3302 2.9177 46.8962 40.0828 1.5449 15.1104 13.7571 8.1132 13.6048 28.0552 7.5002 29.3232 11.1163 12.5826 323.7031 4.1612 72.4623 58.1919 6.5647 289.4144 47.3889 72.3002 36.7373 32.2352 20.1013 11.2636 13.7068 40.9846 48.9934 8.2248 25.1047 7.3999 28.2110 26.9605 17.8169 52.4327 41.1200
temp: 298.150 k
press: 1.00000 atm
elementType: 8 8 7 7 7 6 6 6 6 6 6 6 6 6 6 6 6 1 1 1 1 1 1 1 1 1 1 1 1 1 1 1 1 1
symmnumber: 1
zpe: 724077.2 jmol-1
zpe.correction: 0.275786 hartree
zpe.thermalcorrener: 0.294132 hartree
zpe.thermalcorrenthalpy: 0.295076 hartree
zpe.thermalcorrgfe: 0.228020 hartree
zpe.sumelectzpe: -780.857618 hartree
zpe.sumelectthermal: -780.839273 hartree
zpe.sumelectthermalent: -780.838329 hartree
zpe.sumelectthermalfe: -780.905385 hartree
dipole: -2.1242 2.9382 4.8207
dipole: 6.0320
quadrupole: -85.8908 -92.7646 -99.0054
quadrupole: -10.0050 -10.1562 3.9598
quadrupole: 6.6628 -0.2110 -6.4518 -10.0050 -10.1562 3.9598
hfenergy: -781.1334047 hartree
pointgroup: C01 [X(C12H17N3O2)]
dipole: -1.0163565 -0.9990558 -1.8975768 debye
polarizability: 194.9955559|-7.7022162|159.6141802|-11.4001778|15.3446689|137.6009748 unknown
InChI: InChI=1S/C12H17N3O2/c1-3-9(8-14-15-12(13)16)10-6-4-5-7-11(10)17-2/h4-9,15H,3,13H2,1-2H3
charge 0 multiplicity 1
34 atoms
O  1.104909 1.099062 1.733076
O  -3.576441 1.792723 0.586194
N  -1.793239 -0.314899 0.092508
N  -2.943271 -0.118798 -0.656189
N  -5.017034 0.901156 -1.021199
C  0.391853 -1.364656 0.440425
C  0.808727 -2.859268 0.452027
C  1.44567 -0.418123 -0.153803
C  1.706409 0.829408 0.483353
C  -0.904305 -1.1731 -0.33499
C  2.066107 -3.127683 1.305027
C  2.13672 -0.707883 -1.357228
C  2.620539 1.753797 -0.07527
C  3.048969 0.210968 -1.922441
C  3.288781 1.448393 -1.280544
C  0.051128 2.145859 1.742626
C  -3.8278 0.924153 -0.289227
H  0.207947 -1.028588 1.476334
H  0.977861 -3.217261 -0.584793
H  -0.041329 -3.450551 0.846955
H  -1.015088 -1.744467 -1.282872
H  2.936059 -2.5678 0.917764
H  1.905595 -2.813054 2.352731
H  2.322896 -4.202834 1.307075
H  1.961822 -1.666502 -1.861179
H  2.817058 2.692847 0.454168
H  3.571405 -0.036876 -2.85313
H  4.000419 2.163903 -1.707731
H  -0.129387 2.367176 2.805794
H  -0.872397 1.76286 1.272531
H  0.400109 3.06017 1.224367
H  -3.108429 -0.65619 -1.520056
H  -5.314885 0.115484 -1.596115
H  -5.674778 1.655472 -0.840486
