program: Gaussian 09
title: 000267135
version: EM64L-G09RevD.01
frameworkgroup: C1[X(C12H14O3)]
method: RPBEPBE
basis: SDD
operation: Freq
keyword: #pfreq=noraman
keyword: PBEPBE/SDD
title: #p freq=noraman PBEPBE/SDD
converged: YES YES NO NO
title: Mulliken charges:
elementType: O O O C C C C C C C C C C C C H H H H H H H H H H H H H H
charge: -0.274226 -0.451583 -0.260656 0.320063 -0.209737 0.257923 0.202524 -0.716427 -0.737776 -0.725490 -0.508958 -0.365560 0.262526 -0.344538 0.076782 0.239780 0.235221 0.236787 0.217826 0.234822 0.233715 0.211005 0.224102 0.234698 0.217825 0.279773 0.254427 0.273463 0.381690
chargesum: 0.00000
title: Mulliken charges with hydrogens summed into heavy atoms:
elementType: O O O C C C C C C C C C C C C
charge: -0.274226 -0.069893 -0.260656 0.320063 0.030043 0.257923 0.202524 -0.026593 -0.058234 -0.048866 -0.229185 -0.111133 0.262526 -0.071075 0.076782
polarizability: 2.11206967e+02 -4.52104101e-01 1.37832126e+02 -3.15177307e+00 -3.65235839e+00 8.22637068e+01
1716.lowfreq: -15.0744 -10.2158 -6.7428 -0.0009 -0.0008 -0.0006 41.7568 63.4512 109.8597
frequency: 41.6530 63.4283 109.8594 128.3976 145.3192 188.8225 215.9336 219.8460 233.9641 258.7773 273.7937 287.8080 315.1875 358.5927 388.4118 427.9641 456.2105 475.3787 519.7278 528.2662 540.1065 586.1313 601.8546 629.4792 693.0391 702.4512 722.3928 756.0534 786.3154 804.0186 844.6731 881.5971 924.5467 931.4918 938.3294 979.5732 991.1337 1002.1455 1011.5745 1052.9807 1086.6789 1091.4399 1137.7568 1141.9556 1190.1511 1198.6199 1245.5379 1248.5542 1268.0207 1296.0285 1317.8790 1335.2311 1379.1147 1386.5450 1389.4185 1397.3844 1446.8880 1452.5263 1460.1056 1467.9902 1472.3729 1476.8838 1482.0303 1486.6165 1591.5399 1620.4979 1639.3396 2948.3660 2985.1657 2987.7190 2991.6686 3074.3866 3083.4981 3088.7799 3090.3606 3096.1702 3099.9445 3154.0739 3165.2294 3177.0937 3532.6745
redmass: 3.5251 9.1139 4.7299 4.0307 4.1667 1.1284 1.0763 2.3774 2.1209 1.2932 3.1837 3.0620 4.6737 3.9043 3.8674 2.9366 4.4029 3.8467 3.2984 3.1761 3.6246 1.6190 3.6493 3.5747 5.3074 4.8971 4.5928 4.4344 3.0582 4.3287 1.4785 4.5829 1.4998 1.4143 1.7103 1.3508 1.2843 3.5283 1.8579 1.6800 2.0060 2.3218 1.3758 1.6095 2.0585 2.3308 2.4876 3.2159 1.4867 1.6700 2.6154 1.8778 1.2869 4.6896 1.2596 1.2357 2.6242 1.2396 1.0511 1.0816 3.4131 1.0570 1.0636 1.0648 8.0145 7.3505 8.4820 1.0823 1.0360 1.0358 1.0362 1.0991 1.0988 1.0998 1.1004 1.1001 1.0998 1.0890 1.0924 1.0969 1.0641
irintensity: 0.2061 0.3636 0.1076 1.0972 1.2103 0.0319 0.3204 0.3640 0.6270 0.3873 0.1696 2.4225 0.7689 3.6819 3.2130 17.4737 8.0613 11.8090 12.1964 20.2789 11.1765 76.7441 49.5635 18.1889 7.5687 6.8545 35.8737 21.8212 13.9209 62.2345 36.7794 6.3258 5.5573 15.0834 12.8284 0.8248 1.9418 269.2915 20.6992 8.2836 155.0392 17.2914 49.4804 61.9031 25.8802 9.9269 5.6262 134.0699 8.1676 1.8580 181.8691 21.0294 30.0833 13.9868 13.8741 21.4810 7.8526 1.9465 1.9635 11.5318 127.0658 7.9980 8.3919 13.4763 54.2280 162.3550 328.5581 21.4398 25.1614 16.4524 20.5381 22.9687 9.8925 28.4633 34.8367 19.1610 31.9902 0.2180 1.2757 5.2446 45.6069
temp: 298.150 k
press: 1.00000 atm
elementType: 8 8 8 6 6 6 6 6 6 6 6 6 6 6 6 1 1 1 1 1 1 1 1 1 1 1 1 1 1
symmnumber: 1
zpe: 611288.6 jmol-1
zpe.correction: 0.232828 hartree
zpe.thermalcorrener: 0.247144 hartree
zpe.thermalcorrenthalpy: 0.248088 hartree
zpe.thermalcorrgfe: 0.192188 hartree
zpe.sumelectzpe: -690.261914 hartree
zpe.sumelectthermal: -690.247597 hartree
zpe.sumelectthermalent: -690.246653 hartree
zpe.sumelectthermalfe: -690.302553 hartree
dipole: 3.8525 2.5811 -0.0441
dipole: 4.6374
quadrupole: -90.0679 -84.8299 -89.2205
quadrupole: -3.3791 0.8504 -0.9505
quadrupole: -2.0284 3.2095 -1.1811 -3.3791 0.8504 -0.9505
hfenergy: -690.4947413 hartree
pointgroup: C01 [X(C12H14O3)]
dipole: -1.5162951 -1.0046635 -0.1425962 debye
polarizability: 207.9816653|-0.5080626|138.0636848|20.3878167|-0.9277825|85.2574497 unknown
InChI: InChI=1S/C12H14O3/c1-7-9-6-8(11(13)14)4-5-10(9)15-12(7,2)3/h4-7,13H,1-3H3
charge 0 multiplicity 1
29 atoms
O  -1.912792 1.391167 -0.513791
O  3.531207 -1.691232 0.548734
O  4.382689 0.462873 0.714967
C  -2.714259 0.079308 -0.371621
C  -1.630408 -1.04316 -0.590706
C  -0.33427 -0.321275 -0.233134
C  -0.577706 1.076835 -0.263848
C  -3.302946 0.112858 1.049335
C  -3.790513 0.114947 -1.457782
C  -1.881394 -2.371525 0.1493
C  0.955307 -0.796792 0.01968
C  0.441778 2.028644 -0.067298
C  2.005777 0.144101 0.238894
C  1.740138 1.541177 0.184793
C  3.39193 -0.286596 0.517873
H  -1.604508 -1.260515 -1.680493
H  -2.504576 0.120809 1.812334
H  -3.910491 1.025312 1.174583
H  -3.949798 -0.764147 1.229178
H  -4.476071 0.965987 -1.303532
H  -3.33328 0.212775 -2.457481
H  -4.385032 -0.816957 -1.434066
H  -1.098212 -3.10582 -0.112191
H  -1.865743 -2.2397 1.244799
H  -2.854823 -2.810052 -0.137596
H  1.182029 -1.866409 0.05098
H  0.225144 3.099582 -0.103097
H  2.572948 2.232042 0.352386
H  4.484274 -1.901538 0.739301
