program: Gaussian 09
title: 000267128
version: EM64L-G09RevD.01
frameworkgroup: C1[X(C19H13NO2)]
method: RPBEPBE
basis: SDD
operation: Freq
keyword: #p
keyword: freq=noraman
keyword: PBEPBE/SDD
title: #p freq=noraman PBEPBE/SDD
converged: YES YES NO NO
title: Mulliken charges:
elementType: O O N C C C C C C C C C C C C C C C C C C C H H H H H H H H H H H H H
charge: -0.179123 -0.218922 -0.456427 0.150532 0.154493 0.182746 0.311123 0.209178 -0.189204 0.248581 -0.543643 0.252186 -0.337687 -0.797362 -0.371620 -0.029313 -0.270477 -0.216059 -0.379482 -0.368413 -0.232930 -0.226799 0.308886 0.269334 0.252078 0.248152 0.272900 0.228910 0.230448 0.223606 0.224209 0.286816 0.286398 0.238506 0.238379
chargesum: 0.00000
title: Mulliken charges with hydrogens summed into heavy atoms:
elementType: O O N C C C C C C C C C C C C C C C C C C C
charge: -0.179123 -0.218922 -0.147541 0.150532 0.154493 0.182746 0.311123 0.209178 -0.189204 0.248581 -0.274309 0.252186 -0.085609 -0.047400 -0.141172 -0.029313 -0.046871 0.008150 -0.092666 -0.082016 0.005576 0.011580
polarizability: 3.99385499e+02 -1.94115135e+01 2.44575444e+02 1.34203372e+01 -4.89688183e+00 1.09927298e+02
1716.lowfreq: -7.3394 -3.8536 -0.0008 -0.0007 -0.0004 3.4543 30.2307 39.5162 63.7806
frequency: 30.2077 39.4788 63.7731 108.1243 120.8727 125.5436 161.2277 173.3788 191.0882 194.6693 238.2239 266.4646 291.2125 302.6591 334.0322 364.1268 400.1657 429.4017 435.5187 454.4665 471.8286 482.7609 488.1520 528.7005 563.1950 572.1575 574.6491 629.2458 642.1751 656.7445 669.7959 678.9869 702.5005 727.5924 749.4231 760.9023 782.0433 795.7734 820.4367 832.5538 850.0081 858.5506 911.3981 924.7854 932.3154 933.6101 973.7148 994.9250 995.5621 1010.7256 1013.1641 1022.2948 1038.1667 1041.5354 1077.6486 1107.4960 1121.5245 1161.5256 1170.8015 1186.1819 1221.9452 1236.7192 1256.0667 1261.2155 1301.0564 1307.4195 1330.3634 1345.0249 1397.7192 1402.6839 1415.3378 1430.2616 1440.1873 1456.5897 1461.8919 1469.0577 1475.0761 1485.3098 1515.2453 1541.9688 1548.6087 1565.0328 1587.1691 1603.5333 1608.9840 1630.2729 2972.8341 3046.6902 3095.0010 3127.7828 3135.1002 3140.5057 3149.7126 3153.7422 3159.6618 3160.5568 3170.4050 3184.3137 3593.8496
redmass: 6.3116 5.7444 4.9966 6.6058 3.9793 3.2946 2.4197 1.7604 5.8000 4.9085 3.4725 6.4677 4.2805 3.6809 5.5663 11.0141 3.7794 2.9133 4.6500 9.9981 8.0332 4.3274 5.1361 4.0438 1.1839 3.4583 6.4820 6.0760 5.2703 4.5253 4.1132 5.1065 6.2505 3.1974 1.5680 2.8168 4.1601 1.7835 5.4846 3.5386 1.4906 4.8238 1.4167 2.8984 2.1151 1.4062 1.3132 1.9269 1.4044 2.7950 1.3570 2.2246 1.5484 2.3927 2.9498 2.1713 1.8466 1.3334 1.0811 1.6770 2.0325 1.4217 1.9337 2.2007 2.5207 3.1894 1.9157 3.9616 9.6582 1.6871 2.3122 3.1636 2.5303 3.5064 1.1723 2.7797 1.2956 2.2200 7.1322 6.8457 8.1184 7.0936 6.3880 7.5265 6.9149 7.0383 1.0395 1.0971 1.0968 1.0859 1.0861 1.0910 1.0900 1.0910 1.0973 1.0946 1.1003 1.0960 1.0804
irintensity: 3.4304 1.6332 0.7768 4.2259 0.2809 2.6776 2.0798 0.0482 1.2836 0.4998 2.8123 1.0161 2.3430 0.8667 5.1850 28.6656 0.8069 9.1912 1.8861 1.4388 2.6777 1.0161 0.1889 12.1557 79.8400 12.7897 19.8861 0.8128 7.5259 0.1508 4.2539 7.7614 2.2627 46.5256 73.6409 9.6732 21.9952 56.6122 18.0686 10.2200 1.4820 0.1494 15.4176 11.8750 6.3426 2.5502 0.4892 6.0466 2.7990 27.9869 0.0663 7.5770 18.7009 4.8302 7.5729 2.7582 53.0603 4.4610 13.2659 5.2989 9.4565 2.7761 172.9621 1.5417 311.7548 96.2215 10.1656 290.1940 0.2657 2.1996 21.6322 79.5365 0.8215 92.4817 36.7733 13.5272 6.2956 41.8842 42.5190 219.9107 141.2853 280.9706 0.7305 94.1768 5.3909 1.7868 34.4647 17.4790 10.0757 0.7248 4.3359 17.0302 5.7192 10.1810 42.1788 2.3741 33.3056 8.3219 83.8524
temp: 298.150 k
press: 1.00000 atm
elementType: 8 8 7 6 6 6 6 6 6 6 6 6 6 6 6 6 6 6 6 6 6 6 1 1 1 1 1 1 1 1 1 1 1 1 1
symmnumber: 1
zpe: 697214.0 jmol-1
zpe.correction: 0.265555 hartree
zpe.thermalcorrener: 0.282812 hartree
zpe.thermalcorrenthalpy: 0.283757 hartree
zpe.thermalcorrgfe: 0.220204 hartree
zpe.sumelectzpe: -935.554886 hartree
zpe.sumelectthermal: -935.537628 hartree
zpe.sumelectthermalent: -935.536684 hartree
zpe.sumelectthermalfe: -935.600236 hartree
dipole: 2.3283 0.9902 1.2630
dipole: 2.8278
quadrupole: -99.7764 -119.6777 -132.3510
quadrupole: 23.4991 -1.1750 9.7072
quadrupole: 17.4920 -2.4093 -15.0827 23.4991 -1.1750 9.7072
hfenergy: -935.8204405 hartree
pointgroup: C01 [X(C19H13N1O2)]
dipole: -0.9065136 0.5153616 -0.3878312 debye
polarizability: 397.7147023|14.0166928|229.9109398|27.3820452|43.0172189|126.2625987 unknown
InChI: InChI=1S/C19H13NO2/c1-11-18(14-8-4-5-9-16(14)20-11)15-10-17(21)12-6-2-3-7-13(12)19(15)22/h2-10,20H,1H3
charge 0 multiplicity 1
35 atoms
O  0.293901 -1.301404 -1.446447
O  2.905662 2.180071 1.906059
N  -3.361067 1.656856 -0.165592
C  -1.315208 0.65715 -0.011102
C  -2.342277 -0.38797 -0.094471
C  -1.994347 1.901772 -0.057959
C  0.135676 0.52729 0.143334
C  -3.613172 0.275421 -0.175072
C  0.889555 -0.527395 -0.63362
C  2.374884 -0.616792 -0.450563
C  0.857127 1.381805 0.965779
C  3.072126 0.291214 0.395035
C  -2.329992 -1.806536 -0.057851
C  -1.48005 3.313581 -0.083075
C  -4.843385 -0.410973 -0.232755
C  2.315094 1.347689 1.134478
C  -3.552431 -2.505239 -0.10821
C  -4.79759 -1.819464 -0.198754
C  3.095569 -1.618801 -1.146815
C  4.475857 0.190234 0.538085
C  4.49456 -1.716556 -1.000383
C  5.186327 -0.811182 -0.156405
H  -4.069604 2.38309 -0.256362
H  0.341692 2.124982 1.583179
H  -1.385179 -2.352904 -0.018955
H  -1.510675 3.788969 0.916475
H  -0.432726 3.341736 -0.424887
H  -2.079142 3.941804 -0.768577
H  -5.798135 0.123016 -0.295191
H  -3.546313 -3.600464 -0.087525
H  -5.729951 -2.393021 -0.242327
H  2.539663 -2.301966 -1.796779
H  4.981011 0.904139 1.196593
H  5.048189 -2.491845 -1.540722
H  6.273154 -0.889806 -0.044619
