program: Gaussian 09
title: 000267126
version: EM64L-G09RevD.01
frameworkgroup: C1[X(C19H21N)]
method: RPBEPBE
basis: SDD
operation: Freq
keyword: #pfreq=noraman
keyword: PBEPBE/SDD
title: #p freq=noraman PBEPBE/SDD
converged: YES YES NO NO
title: Mulliken charges:
elementType: N C C C C C C C C C C C C C C C C C C C H H H H H H H H H H H H H H H H H H H H H
charge: -0.459933 0.016842 0.477819 0.434403 0.158650 -0.579313 -0.761035 -0.758585 0.217018 -0.425536 0.116005 -0.383979 0.202015 -0.381675 -0.421013 -0.808389 -0.802971 -0.248329 -0.245031 -0.250402 0.255412 0.205440 0.231054 0.233101 0.232629 0.207610 0.230272 0.239582 0.222227 0.296351 0.249464 0.243895 0.231316 0.235480 0.213654 0.234119 0.242297 0.233562 0.221717 0.219739 0.224516
chargesum: 0.00000
title: Mulliken charges with hydrogens summed into heavy atoms:
elementType: N C C C C C C C C C C C C C C C C C C C
charge: -0.163582 0.016842 0.477819 0.434403 0.158650 -0.323901 -0.091439 -0.088074 0.217018 -0.185954 0.116005 -0.161752 0.202015 -0.132211 -0.177118 -0.127939 -0.092994 -0.026611 -0.025292 -0.025886
polarizability: 2.69252474e+02 4.25449259e+00 2.09628148e+02 -1.71517609e+01 -8.27826988e+00 1.58445290e+02
1716.lowfreq: -7.4699 -2.6111 -0.0006 -0.0005 -0.0002 6.7213 22.7855 40.2515 46.0325
frequency: 22.6167 40.2014 45.9831 81.3255 87.4380 117.6072 139.2358 153.7589 154.9424 199.9357 240.1171 251.2728 266.0578 277.1405 295.6477 314.0990 316.1900 326.6272 333.8722 364.7601 404.5633 418.0852 437.5650 475.7255 492.2050 509.5465 522.4873 558.6218 577.8330 616.4159 619.2086 627.8598 668.6532 677.0071 706.9273 733.9883 763.2303 772.9631 787.4509 807.7184 839.8710 854.4892 895.8217 907.5910 920.3290 930.9721 935.0591 941.4000 972.5685 978.3566 990.2428 993.1695 1004.2726 1025.3946 1037.0794 1046.7411 1056.2960 1072.5093 1086.5784 1106.8043 1135.6612 1153.3132 1162.6112 1171.0329 1194.3749 1219.2785 1236.1438 1239.9730 1248.0630 1305.3549 1312.1211 1319.5922 1373.4141 1377.4751 1389.2986 1394.6960 1408.6728 1413.4195 1432.6817 1435.8231 1452.6003 1465.0221 1466.0750 1469.1405 1470.2119 1472.4589 1476.4919 1480.8451 1482.2392 1487.2996 1488.1657 1585.8100 1589.0645 1608.6946 1610.6498 1637.9787 2964.2719 2965.8033 2973.8173 2978.8226 3031.9115 3034.9570 3068.0409 3073.5034 3074.0661 3082.4497 3084.7834 3096.4117 3115.8740 3123.1251 3124.1440 3126.6862 3136.9394 3150.1279 3159.5179 3162.1907 3606.5536
redmass: 3.7426 4.2605 3.8008 1.0194 3.0376 1.1508 3.0625 3.5625 3.2343 3.3024 3.8941 2.4462 3.2354 1.4177 2.3489 1.6948 1.4455 3.2971 2.8447 4.5182 2.8322 3.4953 2.9528 1.2234 3.1465 3.3851 4.3795 3.1858 4.2027 6.0176 3.3455 4.0070 3.9340 5.6409 1.6269 4.4642 4.1206 2.1364 2.9055 1.5107 3.2734 1.2506 2.5466 1.6548 1.5638 1.5338 1.3655 1.9361 1.4979 1.3865 3.6819 1.5062 1.3181 2.4724 1.4079 1.5095 1.9532 1.8682 1.8548 2.0941 2.1473 3.5051 1.7297 1.0571 1.1171 3.0037 1.5009 3.1556 2.1383 3.8567 1.9532 1.3718 1.7508 2.4552 1.6593 1.2001 1.4917 2.0753 2.2198 2.4167 2.8815 1.1179 1.0679 2.1219 1.0672 1.1478 1.4523 1.3644 1.3220 1.1378 1.1285 6.1545 6.0898 6.0748 6.0217 6.7226 1.0390 1.0381 1.0353 1.0354 1.0980 1.0979 1.0991 1.0995 1.0967 1.1000 1.0995 1.0946 1.0844 1.0875 1.0911 1.0887 1.0932 1.0947 1.0938 1.0997 1.0803
irintensity: 0.0805 0.4097 0.5215 0.1981 1.3722 0.2797 0.8438 1.9404 1.4507 0.4158 0.1125 0.3490 0.1491 0.0612 0.0248 0.0695 0.1102 0.9103 1.6715 0.0807 0.1887 0.3216 4.6367 88.0111 1.7278 5.0617 1.7915 16.4984 0.9906 1.3858 18.2118 1.2357 10.2957 0.6653 59.3151 1.5124 0.6824 28.0517 10.3724 36.7812 0.7068 0.2178 2.6297 13.2544 0.5180 4.4121 2.8322 14.9385 0.4677 0.0547 0.0366 0.7508 2.5641 18.0615 3.0975 0.1984 2.5759 13.8672 5.5846 4.1984 5.3311 10.0276 4.6623 0.1345 1.9672 17.9297 14.2440 22.9237 19.1570 37.8405 16.8045 2.3159 17.6810 7.4471 13.2342 12.2807 6.8885 11.1642 11.0871 19.5148 4.9444 5.0692 1.4847 43.0239 23.6416 4.5428 31.2199 4.1463 6.0167 24.2888 26.5181 1.3697 0.8388 22.8397 8.8470 1.4107 66.9870 56.0809 27.6972 31.4693 19.1860 27.2258 23.8130 63.3687 25.4830 32.0346 40.2212 15.5107 3.9879 2.5374 16.3686 7.2009 31.2569 39.1392 19.5362 18.5858 49.1001
temp: 298.150 k
press: 1.00000 atm
elementType: 7 6 6 6 6 6 6 6 6 6 6 6 6 6 6 6 6 6 6 6 1 1 1 1 1 1 1 1 1 1 1 1 1 1 1 1 1 1 1 1 1
symmnumber: 1
zpe: 903791.7 jmol-1
zpe.correction: 0.344236 hartree
zpe.thermalcorrener: 0.363143 hartree
zpe.thermalcorrenthalpy: 0.364087 hartree
zpe.thermalcorrgfe: 0.297010 hartree
zpe.sumelectzpe: -789.961720 hartree
zpe.sumelectthermal: -789.942813 hartree
zpe.sumelectthermalent: -789.941869 hartree
zpe.sumelectthermalfe: -790.008945 hartree
dipole: 2.6949 0.2327 -0.3784
dipole: 2.7312
quadrupole: -100.4020 -112.6218 -117.2163
quadrupole: 3.0335 -6.7880 -2.9080
quadrupole: 9.6780 -2.5418 -7.1363 3.0335 -6.7880 -2.9080
hfenergy: -790.3059559 hartree
pointgroup: C01 [X(C19H21N1)]
dipole: 1.0556792 0.0885141 -0.1798816 debye
polarizability: 268.0633098|4.387858|210.2763654|-20.7300162|-5.417869|158.9862366 unknown
InChI: InChI=1S/C19H21N/c1-13-14(2)20-18-11-10-16(12-17(13)18)19(3,4)15-8-6-5-7-9-15/h5-12,20H,1-4H3
charge 0 multiplicity 1
41 atoms
N  3.844318 0.660636 -0.635223
C  -1.725699 1.273595 0.664615
C  -0.236881 1.180768 0.232846
C  -2.502762 0.021942 0.180503
C  1.853449 -0.105754 0.170212
C  0.478174 -0.012406 0.49313
C  -1.755638 1.422734 2.215011
C  -2.445886 2.516708 0.058886
C  2.511663 1.027746 -0.42296
C  0.450231 2.284796 -0.359151
C  2.840292 -1.166889 0.305873
C  1.820914 2.224835 -0.694064
C  4.047553 -0.666913 -0.195057
C  -2.404343 -0.370565 -1.1827
C  -3.361371 -0.725878 1.024669
C  2.576724 -2.533624 0.882594
C  5.403812 -1.302558 -0.311167
C  -3.138446 -1.464832 -1.684745
C  -4.098299 -1.827402 0.526983
C  -3.993647 -2.201307 -0.830174
H  -0.041718 -0.87282 0.931207
H  -2.784258 1.58588 2.588289
H  -1.334819 0.532879 2.716179
H  -1.145514 2.294483 2.510884
H  -3.514063 2.496761 0.339601
H  -2.012765 3.45873 0.443018
H  -2.386649 2.525429 -1.04401
H  -0.092849 3.210827 -0.57024
H  2.319357 3.087248 -1.151431
H  4.564202 1.2518 -1.044551
H  -1.727286 0.178988 -1.847632
H  -3.460869 -0.45857 2.081532
H  2.239939 -2.469972 1.935685
H  1.781274 -3.061005 0.321423
H  3.476669 -3.172877 0.86153
H  6.169157 -0.753084 0.271564
H  5.378527 -2.336234 0.069499
H  5.75238 -1.344112 -1.361879
H  -3.041724 -1.747315 -2.739594
H  -4.75271 -2.391511 1.202081
H  -4.563941 -3.05366 -1.216734
