program: Gaussian 09
title: 000267111
version: EM64L-G09RevD.01
frameworkgroup: C1[X(C13H15NO2)]
method: RPBEPBE
basis: SDD
operation: Freq
keyword: #p
keyword: freq=noraman
keyword: PBEPBE/SDD
title: #p freq=noraman PBEPBE/SDD
converged: YES YES NO NO
title: Mulliken charges:
elementType: O O N C C C C C C C C C C C C C H H H H H H H H H H H H H H H
charge: -0.415891 -0.239969 -0.214919 0.255410 0.141441 0.153045 -0.301490 0.216354 -0.384707 -0.800590 -0.708851 -0.362395 -0.664047 0.173270 -0.281812 -0.228787 0.220928 0.261033 0.243704 0.241579 0.235440 0.223833 0.245720 0.219563 0.231963 0.249600 0.239806 0.239097 0.220024 0.218730 0.372917
chargesum: 0.00000
title: Mulliken charges with hydrogens summed into heavy atoms:
elementType: O O N C C C C C C C C C C C C C
charge: -0.042975 -0.239969 -0.214919 0.255410 0.141441 0.153045 -0.080562 0.216354 -0.123674 -0.079867 -0.019734 -0.130432 0.064457 0.173270 -0.061788 -0.010057
polarizability: 1.75595834e+02 6.84254890e+00 1.89388227e+02 6.80920610e+00 -1.26725944e+00 9.62920617e+01
1716.lowfreq: -9.3480 -4.6260 -0.0006 -0.0004 -0.0002 6.5234 35.0412 51.1003 58.9555
frequency: 35.0006 51.0876 58.9414 78.9527 115.8426 133.8576 137.7651 167.2533 180.0573 196.6237 228.5012 256.3090 279.5898 306.1918 307.0757 375.2333 436.5937 439.6137 481.1006 531.6057 552.3147 567.7090 577.7430 606.3662 629.6785 655.7783 676.1338 735.6460 751.9287 758.4452 771.6139 814.5077 853.9702 877.6339 933.9714 946.9004 974.7217 1006.1265 1022.3184 1032.4735 1037.9599 1042.0503 1077.5905 1112.7699 1119.1363 1129.9748 1135.4153 1161.9442 1192.4756 1239.0342 1259.1444 1291.3115 1329.4677 1341.0824 1366.1939 1386.5225 1391.8226 1410.9045 1414.0702 1442.5834 1461.8442 1464.3811 1469.1450 1471.2353 1474.8765 1480.3348 1484.1614 1496.8738 1572.6808 1582.5271 1624.1161 1656.8182 2968.5761 2974.7908 2995.8538 3031.8924 3036.7253 3047.0186 3090.3031 3098.4459 3113.4666 3115.9237 3123.7207 3136.5375 3151.8043 3165.0812 3507.1112
redmass: 6.1996 5.2051 1.0875 4.9100 2.9410 3.5736 2.9406 1.1126 3.6982 1.0569 3.1157 3.1616 5.2290 2.7691 3.8569 5.3315 4.4301 2.9874 5.4379 3.1665 4.4931 3.9364 3.8874 2.4449 2.0180 3.7285 3.9995 4.3420 1.3567 4.2377 4.3713 2.8272 1.4322 2.8928 1.3815 2.2490 1.2972 2.4542 2.2800 1.9790 1.9123 1.7195 1.8772 2.1570 1.3442 1.8183 1.4839 1.4044 2.1264 1.5358 1.9017 1.5152 1.9489 1.8811 3.2751 1.6721 1.4371 1.9324 3.7163 1.3464 1.0934 1.5705 1.4404 1.5419 1.0780 1.0433 1.6910 1.1640 6.2905 6.7483 7.2648 8.1183 1.0398 1.0370 1.0363 1.0828 1.0981 1.1017 1.0999 1.0943 1.0995 1.0962 1.0849 1.0898 1.0953 1.0993 1.0638
irintensity: 0.3910 1.2163 0.2069 0.7444 0.2426 0.1014 5.2218 0.0441 1.7370 0.2786 0.1296 2.5167 1.8946 1.0814 1.0875 2.4095 13.6199 5.4467 1.1518 17.9247 9.6488 13.6720 5.4808 57.2915 62.2015 13.6033 18.1736 18.0866 100.8262 2.5225 2.7180 3.0026 0.6416 1.1442 3.7105 10.5204 0.8188 69.3644 24.3747 101.6150 73.3398 20.6108 35.7760 28.6697 4.3316 6.3657 13.3536 1.8215 3.0688 1.0289 10.7290 4.3635 22.9040 16.0422 29.9937 39.9015 8.5885 25.0884 35.5966 8.5403 23.7655 26.6267 20.1468 2.7270 6.1396 0.0490 43.9236 11.9747 13.1088 1.5380 3.9975 185.8119 47.6583 81.4597 31.1998 13.6193 16.7118 28.3503 33.8268 17.6354 18.3275 10.8177 0.2503 17.3510 24.6027 21.1993 19.9424
temp: 298.150 k
press: 1.00000 atm
elementType: 8 8 7 6 6 6 6 6 6 6 6 6 6 6 6 6 1 1 1 1 1 1 1 1 1 1 1 1 1 1 1
symmnumber: 1
zpe: 659267.2 jmol-1
zpe.correction: 0.251102 hartree
zpe.thermalcorrener: 0.266903 hartree
zpe.thermalcorrenthalpy: 0.267847 hartree
zpe.thermalcorrgfe: 0.207508 hartree
zpe.sumelectzpe: -708.435000 hartree
zpe.sumelectthermal: -708.419199 hartree
zpe.sumelectthermalent: -708.418255 hartree
zpe.sumelectthermalfe: -708.478594 hartree
dipole: -1.4960 4.1432 -0.2457
dipole: 4.4118
quadrupole: -86.0346 -88.7425 -93.4841
quadrupole: -1.1383 0.2091 0.3394
quadrupole: 3.3858 0.6779 -4.0637 -1.1383 0.2091 0.3394
hfenergy: -708.6861021 hartree
pointgroup: C01 [X(C13H15N1O2)]
dipole: -0.4751658 1.6616879 -0.1607318 debye
polarizability: 175.6012522|8.0139185|188.3298087|10.7679417|-3.4074416|97.3450612 unknown
InChI: InChI=1S/C13H15NO2/c1-8(13(15)16)12-9(2)14(3)11-7-5-4-6-10(11)12/h4-8,15H,1-3H3
charge 0 multiplicity 1
31 atoms
O  3.229823 0.29633 -1.390681
O  2.9010 -1.765238 -0.380555
N  -1.421524 1.481887 -0.149301
C  0.585283 0.490393 0.345387
C  -0.414438 -0.554526 0.183962
C  -0.055987 1.719338 0.127957
C  2.046419 0.301202 0.723999
C  -1.658809 0.100669 -0.118511
C  -0.38612 -1.974371 0.245711
C  0.500053 3.1150 0.152557
C  2.232143 -0.356001 2.114914
C  -2.859516 -0.609952 -0.335976
C  -2.452801 2.482165 -0.424366
C  2.750147 -0.523664 -0.356034
C  -1.580919 -2.689175 0.028602
C  -2.805653 -2.016974 -0.254646
H  2.537386 1.290508 0.722375
H  0.551653 -2.506305 0.434422
H  1.575729 3.092989 0.388093
H  0.39388 3.620765 -0.826808
H  0.006151 3.750498 0.913143
H  1.727312 0.254873 2.882927
H  1.796959 -1.367858 2.135454
H  3.30294 -0.439862 2.37467
H  -3.800968 -0.096819 -0.561071
H  -2.00961 3.489214 -0.423141
H  -2.914403 2.308592 -1.414542
H  -3.249475 2.452458 0.342886
H  -1.570213 -3.78401 0.071917
H  -3.717506 -2.602699 -0.417229
H  3.627166 -0.277626 -2.101116
