program: Gaussian 09
title: 000267119
version: EM64L-G09RevD.01
frameworkgroup: C1[X(C17H17N3O5)]
method: RPBEPBE
basis: SDD
operation: Freq
keyword: #p
keyword: freq=noraman
keyword: PBEPBE/SDD
title: #p freq=noraman PBEPBE/SDD
converged: NO YES NO NO
title: Mulliken charges:
elementType: O O O O O N N N C C C C C C C C C C C C C C C C C H H H H H H H H H H H H H H H H H
charge: -0.188718 -0.256547 -0.207058 -0.207382 -0.247119 -0.431724 0.025179 0.026495 0.005157 0.548706 0.473433 -0.747519 -0.741290 -0.550087 -0.440552 -0.356161 -0.394208 0.183868 -0.343757 0.322228 -0.384494 -0.385198 0.383577 0.217147 -0.785188 0.218198 0.236536 0.240639 0.244902 0.218245 0.232536 0.302597 0.257431 0.256418 0.259570 0.321691 0.286539 0.285735 0.361106 0.246489 0.265992 0.246589
chargesum: 0.00000
title: Mulliken charges with hydrogens summed into heavy atoms:
elementType: O O O O O N N N C C C C C C C C C C C C C C C C C
charge: -0.188718 -0.256547 -0.207058 -0.207382 -0.247119 -0.070618 0.025179 0.026495 0.005157 0.548706 0.473433 -0.052146 -0.045607 -0.247490 -0.183121 -0.099743 -0.134639 0.183868 -0.022065 0.322228 -0.097955 -0.099462 0.383577 0.217147 -0.026119
polarizability: 3.38003658e+02 1.55643046e+01 2.20329044e+02 -3.45445069e+01 -7.60589240e+00 1.83786043e+02
1716.lowfreq: -41.5715 -0.0007 -0.0004 -0.0002 4.0476 5.4961 11.3294 15.8517 25.5589
frequency: -41.5656 15.1070 25.5145 36.4817 51.9578 63.0393 74.1629 89.1357 101.9141 114.4528 143.2160 154.7658 161.7587 191.4620 218.1643 247.8292 260.2856 274.0537 286.4408 293.7795 313.5680 324.3343 351.9109 362.1882 373.2322 410.1241 412.1240 426.3334 438.4204 440.8091 492.2498 514.0549 516.4551 544.2887 576.6764 591.4783 607.0838 627.0366 649.4247 667.9545 674.1712 697.0061 700.8719 731.4993 749.3858 757.9856 796.5931 812.5580 851.8235 860.1881 866.3252 875.4494 884.0662 928.9218 934.6357 938.5402 946.5854 988.5265 990.1877 998.2017 1004.8874 1006.8196 1010.8701 1036.4055 1068.6608 1082.2873 1095.3222 1110.6991 1117.5716 1147.0435 1159.2133 1169.2396 1188.4255 1221.9349 1224.4340 1230.0646 1244.1001 1256.3861 1303.0309 1308.0649 1336.8440 1355.3066 1360.1631 1381.3778 1383.3897 1393.8858 1403.1175 1413.4587 1420.5121 1447.6579 1464.1373 1466.0719 1474.8648 1482.3764 1488.1580 1489.9980 1493.3489 1515.1168 1575.0219 1594.5699 1605.9215 1622.3291 1635.3797 2982.3141 2985.3046 2992.9531 3077.8916 3079.3149 3081.1875 3087.5754 3090.0875 3138.2509 3139.9346 3158.6231 3162.1603 3164.5409 3181.5057 3184.3191 3189.7191 3280.7669
redmass: 1.0450 8.2028 7.9927 6.3968 11.8282 4.1559 5.3385 5.2575 7.0853 4.8775 5.5194 5.2374 5.5240 6.5706 4.1772 4.5786 2.3231 4.2220 6.1357 1.3188 2.9180 1.1973 6.0440 3.8446 4.3226 2.8863 4.7505 3.9300 5.0140 4.5718 4.6378 5.4298 5.4221 3.4126 3.6774 3.5891 3.9988 7.0696 5.0258 7.3313 4.3767 7.6218 7.1958 4.5163 4.6952 4.1080 7.8716 4.5101 1.2504 3.0467 1.9121 1.5554 1.1076 2.2737 2.5470 2.0639 1.5705 1.7169 1.3500 1.3814 2.5062 1.3312 1.4463 1.6791 3.2013 2.2508 2.7115 1.7451 1.8415 2.6173 3.0167 2.1890 1.4532 3.9270 2.5355 4.0241 2.0136 2.6989 1.2891 2.1712 5.0137 4.3153 6.7560 1.2388 1.2141 8.8776 1.2212 3.4876 5.0748 1.1423 1.0459 1.1002 1.2753 1.5512 1.9088 1.1242 1.2371 2.8104 3.6426 7.8199 6.2462 5.6944 4.7501 1.0351 1.0357 1.0383 1.0979 1.1000 1.1003 1.0996 1.0998 1.0901 1.0988 1.0895 1.0884 1.0911 1.0946 1.0961 1.0951 1.0797
irintensity: 0.7872 0.1764 0.5699 0.0456 3.8512 0.7552 0.3473 4.7277 1.9148 2.2424 8.4560 0.5205 0.7326 3.1274 0.9851 0.6461 0.2150 0.3233 0.1886 0.2619 1.0465 0.1874 2.4268 0.0205 0.6734 0.1117 2.3577 0.9608 0.6532 1.3664 3.5380 4.0350 13.0447 11.2753 13.8683 3.9772 9.2303 0.2707 3.1173 9.0125 33.4594 6.3729 7.8670 3.1806 4.1287 6.0261 10.5725 12.3103 0.1788 15.7883 43.3548 47.8709 67.8776 1.3401 7.6074 18.5393 12.0089 43.2080 2.0018 0.0611 5.6755 7.3562 6.8421 11.1891 9.4135 37.3694 11.3363 9.0501 4.4642 17.3877 237.1790 37.5328 87.1749 387.9614 92.7417 81.5999 46.2206 9.2351 0.7073 24.2135 414.7127 178.2183 108.5506 73.6961 21.0833 19.7535 9.6015 49.9680 10.2107 32.2049 19.7510 6.0877 15.1816 1.7827 2.3502 20.3542 18.9756 488.4369 253.4862 4.2974 64.7980 37.8735 72.5105 19.1526 20.2952 2.8054 9.4225 9.1576 44.0044 37.1627 33.6867 9.8931 9.0596 6.2326 4.3043 4.1571 0.1846 4.4652 12.8400 108.2507
temp: 298.150 k
press: 1.00000 atm
elementType: 8 8 8 8 8 7 7 7 6 6 6 6 6 6 6 6 6 6 6 6 6 6 6 6 6 1 1 1 1 1 1 1 1 1 1 1 1 1 1 1 1 1
symmnumber: 1
zpe: 832551.3 jmol-1
zpe.correction: 0.317102 hartree
zpe.thermalcorrener: 0.339501 hartree
zpe.thermalcorrenthalpy: 0.340446 hartree
zpe.thermalcorrgfe: 0.263549 hartree
zpe.sumelectzpe: -1196.444725 hartree
zpe.sumelectthermal: -1196.422325 hartree
zpe.sumelectthermalent: -1196.421381 hartree
zpe.sumelectthermalfe: -1196.498277 hartree
dipole: 3.7777 5.1504 0.8175
dipole: 6.4394
quadrupole: -174.9818 -151.8451 -149.1445
quadrupole: -26.6308 -7.0359 7.7230
quadrupole: -16.3247 6.8120 9.5127 -26.6308 -7.0359 7.7230
hfenergy: -1196.7618267 hartree
pointgroup: C01 [X(C17H17N3O5)]
dipole: -1.5004601 1.9803094 -0.4953378 debye
polarizability: 335.7058172|-19.3034752|221.6001046|-37.5250661|4.0754863|184.812823 unknown
InChI: InChI=1S/C17H17N3O5/c1-11(21)18-15-9-6-13(10-16(15)20(24)25)17(2,3)12-4-7-14(8-5-12)19(22)23/h4-10,18H,1-3H3
charge 0 multiplicity 1
42 atoms
O  -1.134959 -2.556834 -1.707101
O  -3.219599 -2.693818 -0.819469
O  5.401364 -1.836288 2.020699
O  6.310117 -1.61155 -0.060221
O  -5.431114 1.013179 1.648629
N  -4.237813 -0.642542 0.465631
N  -2.107556 -2.033789 -1.045411
N  5.383499 -1.3831 0.810743
C  0.850801 1.978275 -0.749569
C  -0.485904 1.295997 -0.367808
C  2.03668 1.050663 -0.387128
C  0.790623 2.302033 -2.272446
C  1.067332 3.319426 0.015363
C  -0.73932 -0.018809 -0.799797
C  -1.519748 1.952271 0.355256
C  2.11841 0.514336 0.929337
C  3.084286 0.756945 -1.297379
C  -1.970305 -0.661972 -0.530042
C  -2.747533 1.331343 0.636588
C  -3.019975 0.002027 0.202081
C  3.203919 -0.28154 1.332204
C  4.182866 -0.040711 -0.91602
C  4.229773 -0.547818 0.398006
C  -5.363388 -0.145751 1.149138
C  -6.505026 -1.152944 1.227025
H  1.680236 2.871551 -2.597424
H  0.712762 1.386844 -2.885913
H  -0.098571 2.922228 -2.481401
H  2.056389 3.735418 -0.243863
H  0.304738 4.067296 -0.268188
H  1.036936 3.181784 1.110721
H  0.014576 -0.587449 -1.351939
H  -1.370834 2.97456 0.715716
H  1.312874 0.717161 1.643706
H  3.051173 1.146761 -2.318205
H  -3.526229 1.853305 1.195086
H  3.273997 -0.697347 2.34063
H  4.993434 -0.27494 -1.611203
H  -4.272515 -1.607367 0.088365
H  -6.849169 -1.442142 0.21705
H  -7.342449 -0.698491 1.774879
H  -6.188276 -2.073601 1.750575
