program: Gaussian 09
title: 000267104
version: EM64L-G09RevD.01
frameworkgroup: C1[X(C14H12N4O4)]
method: RPBEPBE
basis: SDD
operation: Freq
keyword: #p
keyword: freq=noraman
keyword: PBEPBE/SDD
title: #p freq=noraman PBEPBE/SDD
converged: NO YES NO NO
title: Mulliken charges:
elementType: O O O O N N N N C C C C C C C C C C C C C C H H H H H H H H H H H H
charge: -0.266019 -0.254009 -0.267050 -0.264290 -0.168632 -0.420525 -0.217256 -0.081083 0.108190 0.089242 0.093303 0.425933 0.128345 0.206408 -0.481428 0.193964 -0.377125 0.163921 -0.616551 -0.325158 -0.599014 -0.202935 0.341626 0.229763 0.281232 0.272943 0.246302 0.246170 0.257186 0.267874 0.250592 0.250771 0.243287 0.244020
chargesum: 0.00000
title: Mulliken charges with hydrogens summed into heavy atoms:
elementType: O O O O N N N N C C C C C C C C C C C C C C
charge: -0.266019 -0.254009 -0.267050 -0.264290 -0.168632 -0.078899 -0.217256 -0.081083 0.108190 0.089242 0.093303 0.425933 0.128345 0.206408 -0.251665 0.193964 -0.095893 0.163921 0.148865 -0.067971 0.170222 0.284371
polarizability: 3.86644932e+02 -7.62488530e+00 1.98527663e+02 -7.23509645e-02 2.43985520e-03 8.65718914e+01
1716.lowfreq: -42.1847 -7.9631 -2.8713 -1.1424 -0.0011 -0.0010 -0.0009 20.3963 39.7557
frequency: -42.1144 20.3847 39.7457 64.1637 88.1097 96.4695 104.7659 118.2777 131.2152 186.1548 195.8248 206.2415 217.5843 231.6865 295.9214 306.1583 339.2030 351.0000 366.1661 371.8413 392.9045 421.5435 449.0735 475.1142 491.5954 537.6128 581.6459 588.2097 643.0429 655.9456 665.3859 678.0175 698.0537 702.7652 711.4721 733.7024 739.8222 766.7367 779.8762 832.2791 834.3857 854.3739 858.8182 931.0521 942.2751 964.8711 968.7376 976.3531 1037.1659 1049.5689 1063.8213 1085.5650 1109.1452 1120.0117 1130.0756 1131.8609 1144.7900 1195.9900 1223.2225 1227.9880 1253.1106 1265.5325 1280.2381 1290.3748 1323.4578 1364.7757 1381.4537 1396.0358 1417.8680 1423.5974 1431.2771 1462.3603 1472.8795 1473.7406 1478.7747 1479.7099 1485.5178 1503.7468 1546.8501 1578.9068 1606.0497 1615.3241 1627.4198 1655.1899 3006.4873 3012.3121 3020.6203 3095.4338 3101.9035 3104.5448 3137.4753 3139.7102 3161.6314 3169.6227 3189.1352 3593.3695
redmass: 2.2614 5.5799 6.6904 6.4789 2.7294 1.2387 1.2294 2.9755 6.4662 4.7408 5.5960 7.6940 7.6297 6.7688 6.3784 3.0133 6.7351 3.7371 7.8104 5.4300 7.6631 3.3187 9.1842 7.1677 6.1127 7.4973 6.1617 5.5483 2.4365 6.8654 1.8656 9.4260 9.1811 10.3974 6.5389 3.5755 11.1236 4.9381 6.7282 6.5768 1.4015 1.6801 8.8602 4.4700 4.9449 1.3476 3.6446 5.6396 3.1609 2.6325 1.4569 2.7048 4.1284 1.0368 1.3004 1.3018 1.3853 3.2225 2.2921 2.7042 3.7446 1.5986 3.6533 5.4138 4.0937 1.3092 4.6395 5.0813 1.6404 1.8384 1.4618 3.2863 1.0515 1.2465 1.0777 1.0441 1.2540 3.1669 5.1228 8.2270 7.9654 10.2905 7.9456 10.4133 1.0337 1.0328 1.0535 1.1026 1.1192 1.1022 1.1025 1.1009 1.0925 1.0893 1.0970 1.0816
irintensity: 15.0982 0.2565 0.1231 0.1619 0.0758 0.2122 1.1714 3.8009 0.0074 14.4748 3.5240 5.1863 2.7686 0.1434 0.0042 2.1399 1.8645 8.2690 41.0004 0.0547 6.9073 2.7268 10.1863 8.8303 27.2107 11.9830 0.8526 1.7402 17.3588 4.6226 74.4963 1.4249 3.6157 6.5407 1.0520 23.1452 13.0432 0.8214 18.0310 31.1108 17.4507 56.8456 0.2224 4.7445 9.4280 0.2990 23.1380 209.5580 54.8244 21.1136 4.4551 14.2152 21.5624 0.0140 0.3775 0.0686 20.6003 28.5239 319.3610 43.1776 30.7496 4.6240 43.0278 30.5640 50.5401 3.5245 1.2789 50.1588 32.3194 294.2505 173.8461 329.2200 17.7079 4.6077 3.9435 16.8972 39.5652 106.8753 19.6999 42.2501 16.1864 678.8138 11.7965 577.9460 31.5047 36.1662 139.7151 18.1096 27.7858 17.4832 0.8645 0.5924 3.7202 1.2733 4.2771 56.8460
temp: 298.150 k
press: 1.00000 atm
elementType: 8 8 8 8 7 7 7 7 6 6 6 6 6 6 6 6 6 6 6 6 6 6 1 1 1 1 1 1 1 1 1 1 1 1
symmnumber: 1
zpe: 655985.6 jmol-1
zpe.correction: 0.249852 hartree
zpe.thermalcorrener: 0.267869 hartree
zpe.thermalcorrenthalpy: 0.268813 hartree
zpe.thermalcorrgfe: 0.202508 hartree
zpe.sumelectzpe: -1059.059830 hartree
zpe.sumelectthermal: -1059.041813 hartree
zpe.sumelectthermalent: -1059.040869 hartree
zpe.sumelectthermalfe: -1059.107175 hartree
dipole: -5.2945 0.4295 0.0201
dipole: 5.3120
quadrupole: -121.9298 -128.8580 -127.0632
quadrupole: 5.2852 -0.2377 0.0111
quadrupole: 4.0205 -2.9076 -1.1129 5.2852 -0.2377 0.0111
hfenergy: -1059.3096822 hartree
pointgroup: C01 [X(C14H12N4O4)]
dipole: -2.0840291 0.1562106 0.0063396 debye
polarizability: 386.732|-6.4622358|198.3986305|-0.1585846|-2.1598262|86.6138569 unknown
InChI: InChI=1S/C14H12N4O4/c1-17-12-10(13(19)18(2)14(17)20)15-11(16-12)7-3-4-8-9(5-7)22-6-21-8/h3-5,15H,6H2,1-2H3
charge 0 multiplicity 1
34 atoms
O  -4.955371 -1.685805 0.039683
O  -5.917818 0.515679 0.004115
O  2.953897 -2.862798 0.067047
O  5.404644 1.174879 -0.012746
N  3.063379 1.337478 -0.018863
N  0.440134 -1.050007 0.029574
N  4.16967 -0.817042 0.024603
N  0.588402 1.22095 -0.013865
C  1.800857 -0.740373 0.022041
C  1.852774 0.662618 -0.005505
C  -0.269767 0.148152 0.006086
C  -1.729109 0.254714 0.005657
C  2.956939 -1.593168 0.038397
C  4.27756 0.604652 -0.004782
C  -2.564048 -0.909031 0.025926
C  -3.940221 -0.700524 0.024965
C  -2.31006 1.55357 -0.015732
C  -4.508393 0.593289 0.003855
C  3.09998 2.812373 -0.046046
C  -3.712957 1.742875 -0.017268
C  5.456564 -1.549668 0.042079
C  -6.24221 -0.938087 0.044478
H  0.071847 -2.000054 0.042231
H  -2.167303 -1.928193 0.041407
H  -1.635538 2.413838 -0.03102
H  4.155971 3.118724 -0.043539
H  2.582512 3.219487 0.838776
H  2.597073 3.186763 -0.953503
H  -4.155882 2.741246 -0.033883
H  5.2206 -2.623842 0.057997
H  6.040665 -1.268952 0.933735
H  6.048608 -1.296162 -0.852361
H  -6.782822 -1.157854 0.980734
H  -6.814879 -1.201827 -0.860276
