program: Gaussian 09
title: 000267091
version: EM64L-G09RevD.01
frameworkgroup: C1[X(C16H24N4O3)]
method: RPBEPBE
basis: SDD
operation: Freq
keyword: #p
keyword: freq=noraman
keyword: PBEPBE/SDD
title: #p freq=noraman PBEPBE/SDD
converged: YES YES NO NO
title: Mulliken charges:
elementType: O O O N N N N C C C C C C C C C C C C C C C C H H H H H H H H H H H H H H H H H H H H H H H H
charge: -0.266438 -0.291402 -0.274793 -0.212433 -0.120745 -0.159469 -0.220100 -0.041006 -0.463392 -0.436137 -0.406210 -0.407962 0.010929 -0.384950 -0.750550 0.224549 0.126620 0.088730 0.157148 -0.633966 0.209448 -0.616186 -0.601370 0.216168 0.213298 0.196583 0.187141 0.224812 0.200986 0.194076 0.193404 0.202026 0.243738 0.203011 0.190576 0.228354 0.222488 0.250529 0.242025 0.241176 0.294847 0.273190 0.242930 0.243501 0.268469 0.248306 0.248051
chargesum: 0.00000
title: Mulliken charges with hydrogens summed into heavy atoms:
elementType: O O O N N N N C C C C C C C C C C C C C C C C
charge: -0.266438 -0.291402 -0.274793 -0.212433 -0.120745 -0.159469 -0.220100 0.175162 -0.053511 -0.024185 -0.011147 -0.012532 0.254667 0.008636 -0.049178 0.224549 0.126620 0.088730 0.157148 0.144083 0.209448 0.143435 0.163456
polarizability: 2.95555979e+02 -3.09413353e+00 2.09797702e+02 1.30236587e+01 2.42788342e+00 1.44213441e+02
1716.lowfreq: -19.4750 -2.1834 -0.0003 0.0006 0.0008 4.9252 14.3204 22.2198 36.1791
frequency: 4.2064 21.9355 35.7940 49.5924 70.6040 81.6586 85.8356 102.0380 110.1615 118.9034 127.9618 132.3500 158.1170 194.0838 212.0112 218.2485 224.1447 231.8764 252.3894 269.9945 294.8045 308.8325 326.1915 345.6352 365.1031 372.2899 386.3489 397.5134 421.6635 425.6393 432.1794 462.6056 477.2694 508.3044 522.6529 579.4580 638.1621 641.7091 685.5499 702.2273 721.3605 731.6759 750.5688 782.6160 785.1713 799.6071 838.6738 854.7203 878.0732 891.0088 913.5660 921.0724 956.3211 964.0979 978.8804 1025.5821 1037.0677 1049.5908 1052.9130 1055.5706 1076.6958 1090.1455 1114.9543 1130.1463 1130.6453 1132.2626 1135.3720 1162.5729 1169.9201 1189.7766 1196.2323 1216.1346 1228.9888 1234.2509 1256.6623 1260.3192 1265.0738 1275.7583 1298.6335 1300.5942 1312.9056 1328.0445 1334.5214 1339.1432 1342.2110 1345.2215 1361.8450 1363.5410 1390.7759 1396.5430 1411.9093 1426.9444 1446.0863 1459.5117 1462.2885 1463.4376 1464.4820 1465.8173 1467.9623 1475.2749 1475.6416 1477.7096 1478.6408 1481.6629 1483.0053 1485.7308 1498.6801 1504.0083 1576.8690 1615.1812 1651.0760 2952.4811 2956.5912 2965.8987 2966.6077 2967.4246 2969.2069 2994.0836 2998.5954 3004.8435 3010.5372 3016.7372 3028.4825 3029.3399 3033.7190 3040.7797 3049.9855 3090.4929 3093.2136 3093.3764 3098.6942 3101.8361 3122.1530 3136.5795 3136.8984
redmass: 3.3515 4.2661 3.1754 1.4449 4.0013 1.0617 3.4730 2.5959 2.7899 3.8130 1.1466 3.0136 3.4533 2.9597 2.5403 1.8646 2.7158 4.1451 3.1508 2.0595 2.5104 3.2557 3.4833 3.6573 6.5479 3.7070 7.1322 2.6072 4.2352 4.6232 3.8198 3.1104 3.4550 3.4941 2.5250 4.5199 4.7835 10.4000 11.4180 11.3721 7.1292 11.2142 5.2449 2.5339 1.4669 4.0950 3.0024 3.1781 1.6251 1.5017 2.1016 2.0982 6.3178 2.6244 1.7326 2.2338 2.1359 3.0534 1.8929 1.1906 1.6819 1.5971 2.4616 1.2968 1.2991 1.3015 2.0875 2.7320 2.2800 1.5228 3.1665 5.0676 2.7895 1.4375 1.2788 1.2494 6.3230 1.2679 5.2873 1.2725 1.2448 1.4314 1.3595 1.4160 1.4855 1.6053 5.4344 1.5912 1.2472 2.0965 1.3239 1.2687 2.5963 1.0825 1.0804 1.0822 1.5327 1.1043 1.0810 1.0456 1.0935 1.0808 1.0447 1.0775 1.1005 1.1636 2.0157 2.5485 7.6365 10.8831 9.9757 1.0753 1.0656 1.0646 1.0675 1.0633 1.0641 1.0363 1.0334 1.0336 1.0328 1.0864 1.0967 1.0955 1.0996 1.1008 1.0981 1.1021 1.1024 1.0984 1.1008 1.1021 1.1033 1.1023 1.1009
irintensity: 0.0994 0.1036 0.0992 0.9441 0.1261 0.0023 0.6160 0.0280 0.0201 0.0303 1.2421 16.0169 1.7989 4.2817 8.7068 1.1984 1.0093 1.5670 0.5559 0.2371 2.1368 0.4043 0.4122 7.8215 0.9683 3.7748 19.0174 2.0759 9.6339 1.5978 2.3352 14.1736 9.4254 18.4864 0.3132 3.8084 7.9250 6.1363 1.7542 6.6109 20.8654 16.2714 0.1359 0.3887 0.0577 9.7368 41.0709 52.4736 3.9600 19.8625 11.2273 10.7398 30.3331 50.4811 5.9999 138.2503 58.5047 5.0099 0.9055 0.0927 4.5077 23.3133 3.3330 0.7031 0.2226 0.1107 31.7628 99.8130 10.5838 0.9664 17.4092 33.9216 2.7531 5.1845 13.5306 9.4845 51.2260 2.4576 14.4080 0.8632 123.9769 3.3088 5.5898 3.4965 0.4670 0.6098 40.8317 1.2829 29.0778 15.3291 0.9151 86.8248 636.3940 0.7051 1.6316 10.8959 3.6577 7.2014 20.7083 14.6586 4.3596 18.9569 16.6126 48.4310 22.3560 11.2475 332.3166 182.3236 64.2165 497.8101 491.0237 5.4223 20.4570 19.9773 15.3978 32.8893 74.1934 12.3453 45.0898 35.2242 33.0107 7.1380 85.6136 83.4276 1.5049 69.7858 70.6513 17.1265 19.8951 28.2665 22.2962 18.8449 0.3932 0.8223 0.4779
temp: 298.150 k
press: 1.00000 atm
elementType: 8 8 8 7 7 7 7 6 6 6 6 6 6 6 6 6 6 6 6 6 6 6 6 1 1 1 1 1 1 1 1 1 1 1 1 1 1 1 1 1 1 1 1 1 1 1 1
symmnumber: 1
zpe: 1025765.2 jmol-1
zpe.correction: 0.390693 hartree
zpe.thermalcorrener: 0.414229 hartree
zpe.thermalcorrenthalpy: 0.415173 hartree
zpe.thermalcorrgfe: 0.334768 hartree
zpe.sumelectzpe: -1067.073483 hartree
zpe.sumelectthermal: -1067.049947 hartree
zpe.sumelectthermalent: -1067.049003 hartree
zpe.sumelectthermalfe: -1067.129408 hartree
dipole: 5.9397 -0.4396 0.8401
dipole: 6.0149
quadrupole: -148.9704 -140.1338 -135.4880
quadrupole: -2.0838 -0.7524 -1.2102
quadrupole: -7.4396 1.3969 6.0427 -2.0838 -0.7524 -1.2102
hfenergy: -1067.4641763 hartree
pointgroup: C01 [X(C16H24N4O3)]
dipole: -2.3411054 -0.1403844 -0.3154416 debye
polarizability: 295.8404477|1.8671199|209.8322881|11.5891064|1.3704072|143.894386 unknown
InChI: InChI=1S/C16H24N4O3/c1-10(11-8-6-5-7-9-11)23-15-17-13-12(18(15)2)14(21)20(4)16(22)19(13)3/h10-11H,5-9H2,1-4H3
charge 0 multiplicity 1
47 atoms
O  -1.458052 0.650866 -0.611722
O  3.677178 2.514547 -0.026688
O  5.023982 -1.978286 0.500499
N  0.780627 1.366879 -0.353457
N  0.393764 -0.89821 -0.252774
N  2.739718 -1.575342 0.14019
N  4.324165 0.244099 0.236012
C  -3.783913 0.034438 -0.298898
C  -4.915337 -1.009043 -0.50993
C  -3.741533 0.484743 1.186001
C  -6.283424 -0.472621 -0.022613
C  -5.108226 1.024511 1.666688
C  -2.419086 -0.520475 -0.751763
C  -6.229963 -0.018054 1.45427
C  -2.340503 -1.017219 -2.19957
C  -0.147616 0.342718 -0.416552
C  2.027371 0.740455 -0.123911
C  1.744656 -0.633815 -0.069939
C  3.346044 1.285592 0.019897
C  0.51611 2.808789 -0.479367
C  4.083471 -1.154734 0.303956
C  2.413602 -3.012448 0.197444
C  5.736934 0.653421 0.405116
H  -4.01042 0.921859 -0.92895
H  -4.991126 -1.286679 -1.578178
H  -4.665412 -1.935828 0.049247
H  -3.453228 -0.385377 1.814136
H  -2.957115 1.251878 1.318684
H  -7.058635 -1.251346 -0.158621
H  -6.580681 0.388911 -0.656067
H  -5.357103 1.947595 1.102957
H  -5.045094 1.310761 2.734254
H  -2.060416 -1.30395 -0.056032
H  -7.208415 0.399222 1.761086
H  -6.038308 -0.898423 2.102316
H  -2.954175 -1.925807 -2.3284
H  -2.703156 -0.246699 -2.902709
H  -1.30064 -1.281031 -2.456114
H  -0.005476 3.016765 -1.428556
H  -0.113159 3.160039 0.356567
H  1.48433 3.331979 -0.457274
H  3.351592 -3.557365 0.377643
H  1.961156 -3.337393 -0.754716
H  1.696875 -3.206066 1.013245
H  5.771515 1.748904 0.313861
H  6.362966 0.17904 -0.368195
H  6.108257 0.335099 1.393126
