program: Gaussian 09
title: 000267092
version: EM64L-G09RevD.01
frameworkgroup: C1[X(C16H24N4O3)]
method: RPBEPBE
basis: SDD
operation: Freq
keyword: #p
keyword: freq=noraman
keyword: PBEPBE/SDD
title: #p freq=noraman PBEPBE/SDD
converged: YES YES NO NO
title: Mulliken charges:
elementType: O O O N N N N C C C C C C C C C C C C C C C C H H H H H H H H H H H H H H H H H H H H H H H H
charge: -0.239490 -0.290436 -0.273750 -0.208468 -0.158485 -0.112633 -0.220690 0.035297 -0.451454 -0.449012 -0.404412 -0.403228 -0.382827 -0.453158 -0.297290 0.203987 0.128854 0.092803 0.160561 -0.633269 0.210947 -0.615629 -0.601403 0.189532 0.204727 0.191729 0.191855 0.199542 0.192192 0.200930 0.200210 0.193495 0.202022 0.189253 0.214114 0.216394 0.241473 0.228554 0.242835 0.295092 0.243133 0.243902 0.272936 0.243753 0.268539 0.248435 0.248537
chargesum: 0.00000
title: Mulliken charges with hydrogens summed into heavy atoms:
elementType: O O O N N N N C C C C C C C C C C C C C C C C
charge: -0.239490 -0.290436 -0.273750 -0.208468 -0.158485 -0.112633 -0.220690 0.224829 -0.054998 -0.057615 -0.011290 -0.009522 0.008448 -0.022650 0.172738 0.203987 0.128854 0.092803 0.160561 0.147791 0.210947 0.144962 0.164108
polarizability: 2.99503182e+02 -3.94713881e+00 2.16863026e+02 -4.96638980e+00 -3.11389445e+00 1.32724809e+02
1716.lowfreq: -6.0881 -0.0010 -0.0008 -0.0004 2.5029 8.3292 19.1278 25.0445 33.8626
frequency: 19.1014 23.5534 33.3082 62.7752 71.8829 85.0812 98.1938 105.7412 108.2866 114.0409 126.5677 133.4323 141.1543 159.4884 173.9790 214.5820 217.0272 232.1793 249.6478 274.9012 303.0641 315.2092 321.3225 351.3366 362.1444 368.6091 390.3562 409.1729 426.2749 431.2757 450.1370 460.5859 500.4669 540.8287 575.1382 642.3934 646.2893 685.9793 702.5194 722.0389 732.8704 752.3096 766.6657 780.7986 790.9467 812.8495 843.6870 869.4739 887.8101 908.1787 919.2280 956.4424 960.1121 973.1567 992.1158 1031.6623 1050.1041 1051.6214 1055.4921 1066.7955 1090.8217 1096.3383 1115.9965 1129.7599 1131.0943 1132.0926 1150.8738 1166.4516 1181.2690 1195.5011 1196.6093 1216.5170 1228.8759 1244.4784 1256.1019 1260.3840 1265.0485 1274.5829 1279.0881 1297.9880 1312.0938 1316.7574 1333.4761 1338.4919 1339.9113 1341.6123 1361.3660 1364.8148 1366.2378 1398.1342 1412.8528 1427.1840 1447.0702 1455.9095 1461.5442 1462.3499 1464.5988 1466.7578 1468.8276 1475.1595 1475.6013 1477.4253 1479.3718 1482.2532 1484.2297 1485.2989 1502.7730 1507.4840 1577.8218 1616.2185 1651.0190 2932.3517 2953.1389 2958.7868 2964.6207 2965.6060 2966.2749 2981.8891 3000.1761 3005.3090 3006.1890 3010.8430 3016.1662 3021.7612 3027.7746 3029.3914 3037.7222 3042.2706 3082.5460 3092.5313 3093.9568 3102.2649 3122.9266 3137.0051 3137.4553
redmass: 4.0011 4.0300 3.9264 3.2709 1.9541 2.5066 1.0587 2.0556 2.7044 3.1182 1.1921 2.5432 4.1954 3.8958 2.9695 3.1794 1.8359 5.2181 7.3163 3.1803 3.0864 1.8606 6.1257 3.4951 3.7548 8.5811 7.6458 6.0709 2.3063 3.0120 3.1968 4.6309 4.3866 2.4093 4.9746 10.6206 5.2570 11.3776 11.3339 7.4091 11.1869 2.8705 2.3650 1.4447 1.5820 6.2588 1.9510 1.7743 1.6813 2.2018 3.3075 6.2366 2.3031 2.9114 1.4611 2.7100 3.0789 1.8098 1.2242 1.8516 2.0738 2.0241 2.4465 1.3008 1.2974 1.2991 2.1117 2.6740 1.3782 1.4338 3.0533 5.3608 2.7420 1.2919 1.2723 1.2127 6.3256 1.1912 1.2189 6.3780 1.2958 1.2560 1.3863 1.5140 1.4557 1.5744 1.5165 3.7673 1.8334 2.1173 1.3066 1.2637 2.3045 1.1006 1.0887 1.1005 1.4257 1.1493 1.0877 1.0441 1.1021 1.0805 1.0428 1.1336 1.0439 1.1756 2.3254 2.4686 7.5610 10.8975 9.9626 1.0812 1.0613 1.0623 1.0633 1.0612 1.0653 1.0596 1.0331 1.0359 1.0568 1.0328 1.0968 1.0988 1.0941 1.1021 1.1023 1.1027 1.1080 1.1025 1.1024 1.1021 1.1032 1.1023 1.1010
irintensity: 0.1445 0.0793 0.1006 0.0037 0.6747 0.2196 0.2398 1.0621 0.3776 2.3169 0.0310 10.9796 8.1495 1.0974 0.3768 12.2454 1.1379 0.9883 0.0172 0.0925 2.6130 0.1046 0.0364 10.2984 8.7193 0.0811 19.8120 2.4308 2.3545 0.1272 5.3709 23.9464 16.8377 2.5853 7.4728 6.2039 4.7623 1.5824 7.0490 17.2210 15.9974 1.6700 1.3047 0.2580 0.8539 3.7375 5.1795 2.0840 20.8231 26.7332 70.2411 33.4072 1.6785 135.4779 2.5538 60.3502 5.7760 2.3317 3.1895 27.6440 0.9420 14.3188 1.2240 0.4278 0.1789 0.1505 0.7043 108.2136 6.4608 0.5124 13.9039 25.7477 2.7526 2.0805 1.6043 1.3015 47.5580 1.0612 1.1615 23.3456 4.2523 6.8093 4.3862 9.0619 11.3432 5.4140 35.5053 72.7954 99.0182 36.4663 1.5689 67.4654 578.2458 3.0817 6.9567 7.4498 2.6500 15.1703 29.2225 16.2339 3.3256 14.0618 17.3380 28.8651 19.0301 51.9054 58.2768 364.9249 66.6840 501.0080 488.4994 8.7533 24.4993 57.4486 27.7827 34.5728 27.5571 22.1203 44.9983 17.9734 41.5366 31.2984 75.6381 48.9271 61.2871 17.6200 8.8947 137.7122 38.3109 18.2883 20.6139 18.9244 0.4086 0.8229 0.4570
temp: 298.150 k
press: 1.00000 atm
elementType: 8 8 8 7 7 7 7 6 6 6 6 6 6 6 6 6 6 6 6 6 6 6 6 1 1 1 1 1 1 1 1 1 1 1 1 1 1 1 1 1 1 1 1 1 1 1 1
symmnumber: 1
zpe: 1027627.3 jmol-1
zpe.correction: 0.391403 hartree
zpe.thermalcorrener: 0.414766 hartree
zpe.thermalcorrenthalpy: 0.415710 hartree
zpe.thermalcorrgfe: 0.336814 hartree
zpe.sumelectzpe: -1067.067036 hartree
zpe.sumelectthermal: -1067.043673 hartree
zpe.sumelectthermalent: -1067.042729 hartree
zpe.sumelectthermalfe: -1067.121625 hartree
dipole: 6.0081 -0.4730 -0.1568
dipole: 6.0287
quadrupole: -151.2867 -141.4706 -135.7465
quadrupole: 2.6344 0.0534 0.2298
quadrupole: -8.4521 1.3640 7.0881 2.6344 0.0534 0.2298
hfenergy: -1067.4584385 hartree
pointgroup: C01[X(C16H24N4O3)]
dipole: 2.3639581 -0.1883372 -0.0458189 debye
polarizability: 299.5429451|-4.0720685|216.6558669|-4.0788264|-5.2425993|132.8922049 unknown
InChI: InChI=1S/C16H24N4O3/c1-18-12-13(19(2)16(22)20(3)14(12)21)17-15(18)23-10-9-11-7-5-4-6-8-11/h11H,4-10H2,1-3H3
charge 0 multiplicity 1
47 atoms
O  0.931981 -1.240428 -0.055892
O  -4.465732 -2.227395 0.313028
O  -5.130767 2.416471 -0.210098
N  -1.407784 -1.581162 0.091457
N  -2.915522 1.639348 -0.22221
N  -0.680341 0.581777 -0.199123
N  -4.767442 0.114285 0.049881
C  4.596106 -0.111288 -0.324293
C  4.783841 0.89607 0.842278
C  5.867595 -0.986613 -0.484237
C  6.063901 1.750402 0.67452
C  7.146024 -0.133247 -0.657669
C  7.320016 0.862616 0.512763
C  3.346667 -1.01332 -0.137462
C  2.03478 -0.232586 -0.182581
C  -0.33122 -0.727383 -0.058991
C  -2.556025 -0.756617 0.045961
C  -2.06727 0.547362 -0.131522
C  -3.951329 -1.07365 0.150922
C  -1.361872 -3.041402 0.26829
C  -4.317384 1.450483 -0.132606
C  -2.373195 2.997578 -0.412927
C  -6.235987 -0.052416 0.141547
H  4.469709 0.473214 -1.263772
H  3.904494 1.564246 0.925778
H  4.845205 0.326607 1.794422
H  5.976011 -1.626393 0.417571
H  5.745076 -1.670428 -1.347796
H  5.95679 2.394527 -0.223111
H  6.180526 2.428785 1.541783
H  8.032579 -0.79201 -0.73632
H  7.082331 0.432365 -1.610549
H  8.21615 1.492325 0.350525
H  7.490871 0.296353 1.451992
H  3.41874 -1.551111 0.82847
H  3.325149 -1.781518 -0.934979
H  1.926796 0.48776 0.646896
H  1.898773 0.307651 -1.137862
H  -0.804661 -3.298227 1.185234
H  -2.398304 -3.403295 0.34767
H  -0.864115 -3.515139 -0.594617
H  -1.693475 3.253671 0.417008
H  -3.2244 3.693327 -0.436977
H  -1.810244 3.05253 -1.360031
H  -6.43357 -1.124451 0.287276
H  -6.716795 0.308118 -0.782586
H  -6.631275 0.53371 0.98724
