program: Gaussian 09
title: 000267072
version: EM64L-G09RevD.01
frameworkgroup: C1[X(C6H15N6O7P)]
method: RPBEPBE
basis: SDD
operation: Freq
keyword: #p
keyword: freq=noraman
keyword: PBEPBE/SDD
title: #p freq=noraman PBEPBE/SDD
converged: YES YES NO NO
title: Mulliken charges:
elementType: P O O O O O O O N N N N N N C C C C C C H H H H H H H H H H H H H H H
charge: 1.398002 -0.507660 -0.351149 -0.344496 -0.351860 -0.204148 -0.201920 -0.204924 -0.825982 -0.823196 -0.819671 -0.322809 -0.321479 -0.322086 0.444832 0.438501 0.446737 -0.488574 -0.487618 -0.488242 0.407128 0.410555 0.409540 0.324285 0.326538 0.323316 0.263696 0.220509 0.230190 0.233072 0.221497 0.253731 0.263606 0.220362 0.229715
chargesum: 0.00000
title: Mulliken charges with hydrogens summed into heavy atoms:
elementType: P O O O O O O O N N N N N N C C C C C C
charge: 1.398002 -0.507660 -0.351149 -0.344496 -0.351860 -0.204148 -0.201920 -0.204924 -0.418854 -0.412641 -0.410130 0.001477 0.005059 0.001230 0.444832 0.438501 0.446737 0.225821 0.220682 0.225442
polarizability: 2.00187148e+02 -3.58452660e-01 1.92388672e+02 -9.06625641e-01 -9.31473805e-01 1.14437537e+02
1716.lowfreq: -2.6809 -0.0012 -0.0010 -0.0009 3.3009 4.5433 28.4373 30.7354 36.7896
frequency: 28.4241 30.7254 36.7769 52.7287 60.7312 61.7835 73.9801 75.7190 98.5958 102.0678 110.2121 121.2672 130.2823 136.7318 164.8546 180.4962 182.7153 223.9464 228.4674 229.1778 239.3923 285.9620 288.8618 306.8990 312.6646 326.4883 383.7354 384.8626 393.7344 401.1654 411.3684 419.8527 468.6821 478.2391 481.8786 676.9211 690.5057 692.1401 708.1906 716.8062 720.3874 741.7684 782.1069 788.0990 791.1951 807.8359 810.3600 865.8343 872.4788 876.8950 973.3610 974.1741 977.9960 1061.1867 1063.6325 1065.3354 1088.7065 1106.8937 1107.6153 1109.2423 1156.9730 1157.6042 1157.8937 1222.2605 1227.1095 1230.3938 1346.1366 1401.3810 1403.1459 1410.5562 1413.0484 1414.4025 1438.9295 1439.2779 1440.5318 1444.9708 1448.0511 1453.2178 1477.8328 1478.6994 1478.8270 1591.5234 1593.3892 1622.5678 2985.8405 2987.1434 2987.7652 3095.9355 3100.5885 3100.8588 3127.7386 3130.7913 3131.0363 3220.7326 3244.6862 3269.8846 3531.9633 3536.6677 3537.2752
redmass: 5.6286 4.5340 6.1796 3.5076 4.2129 4.0808 5.5711 4.7405 4.1766 4.1231 4.8411 8.4340 3.5811 3.4951 1.5576 1.5620 1.5044 2.6977 3.6871 3.9767 5.6284 5.3491 7.0019 5.8678 6.4512 6.6367 1.8572 1.8420 3.1025 1.8411 2.6236 2.1524 4.5322 4.8633 4.6298 7.0206 6.5546 6.3624 5.9695 5.1300 5.1256 4.6393 1.9343 2.2949 1.5784 2.0477 2.1747 6.0527 6.1915 6.2208 6.2086 6.4980 5.9879 7.3297 5.8832 5.3960 6.6978 1.2714 1.2688 1.2850 1.4411 1.4413 1.4362 1.4821 1.8588 1.7986 1.8875 1.2724 1.2298 1.1519 1.2208 1.2271 1.0567 1.0585 1.0827 2.0555 2.1825 2.2892 1.0564 1.0568 1.0597 6.5505 6.4553 3.9890 1.0287 1.0289 1.0289 1.1056 1.1046 1.1044 1.1041 1.1051 1.1051 1.0807 1.0821 1.0812 1.0793 1.0800 1.0801
irintensity: 2.1379 2.1630 0.2650 1.0974 3.2549 2.1591 0.9421 4.6103 2.2110 4.8838 3.1807 21.2975 24.6981 11.7374 1.2022 5.6958 8.4775 3.1733 2.5742 2.9985 0.1230 11.0984 4.5021 51.1632 57.3356 3.8796 137.5114 54.2280 38.0369 19.6850 20.1814 75.9809 5.9962 55.7159 33.8236 3.2853 95.4440 62.7766 10.5970 13.0879 9.1145 23.1405 44.9975 148.4318 165.9020 156.4554 82.4566 8.5079 11.1466 38.4313 13.9158 9.2121 8.5576 54.6663 74.1533 59.6691 177.3846 11.8076 8.2404 9.8989 10.0986 10.3129 4.7521 5.7473 61.8469 72.7336 37.4319 358.1800 234.7793 26.7008 268.1458 272.0664 29.3938 31.0365 83.6581 829.0139 890.1296 110.8847 5.7241 11.2850 9.4397 142.3707 137.4664 1.3592 50.0379 54.6025 48.8911 27.7673 25.2282 25.8873 19.0861 15.6600 16.8896 302.0827 478.6664 457.2176 41.5506 42.0357 35.7256
temp: 298.150 k
press: 1.00000 atm
elementType: 15 8 8 8 8 8 8 8 7 7 7 7 7 7 6 6 6 6 6 6 1 1 1 1 1 1 1 1 1 1 1 1 1 1 1
symmnumber: 1
zpe: 666444.2 jmol-1
zpe.correction: 0.253835 hartree
zpe.thermalcorrener: 0.277924 hartree
zpe.thermalcorrenthalpy: 0.278868 hartree
zpe.thermalcorrgfe: 0.197861 hartree
zpe.sumelectzpe: -1432.215768 hartree
zpe.sumelectthermal: -1432.191679 hartree
zpe.sumelectthermalent: -1432.190735 hartree
zpe.sumelectthermalfe: -1432.271742 hartree
dipole: 0.1312 -0.5771 -3.4269
dipole: 3.4776
quadrupole: -98.7063 -106.4525 -141.0765
quadrupole: -0.8123 -1.1271 -10.2247
quadrupole: 16.7054 8.9593 -25.6647 -0.8123 -1.1271 -10.2247
hfenergy: -1432.469603 hartree
pointgroup: C01 [X(C6H15N6O7P1)]
dipole: -0.0275607 0.1919217 1.3544023 debye
polarizability: 199.3495903|2.3477879|193.1615987|2.0466432|1.7422453|114.5021678 unknown
InChI: InChI=1S/C6H15N6O7P/c1-17-7-4(13)10-20(16,11-5(14)8-18-2)12-6(15)9-19-3/h7-12H,1-3H3
charge 0 multiplicity 1
35 atoms
P  0.025785 0.146812 -0.803372
O  -0.045884 0.349286 -2.373058
O  0.980818 2.756484 0.57997
O  2.014068 -2.124581 -0.011161
O  -2.794672 -0.5789 0.19925
O  3.605111 3.121326 1.551188
O  1.238765 -4.798896 0.316867
O  -4.488521 1.217221 1.561577
N  1.555557 0.554274 -0.023298
N  -0.247601 -1.498647 -0.223316
N  -1.12867 1.079141 0.153816
N  3.204759 2.035504 0.702027
N  0.302457 -3.706248 0.279381
N  -3.282917 1.607357 0.884638
C  1.857416 1.837187 0.441255
C  0.774392 -2.428718 -0.011277
C  -2.423713 0.6245 0.414404
C  3.707289 4.37984 0.758933
C  1.897359 -4.860101 1.648231
C  -5.562498 0.936355 0.567613
H  2.174828 -0.278898 0.073419
H  -1.254801 -1.675109 -0.032651
H  -0.723503 1.979831 0.484416
H  3.905808 1.293166 0.645691
H  -0.626129 -4.019697 -0.01507
H  -2.973936 2.54814 1.140429
H  2.71264 4.658523 0.374754
H  4.432537 4.261598 -0.066303
H  4.066968 5.119712 1.491289
H  2.517484 -5.768578 1.591418
H  1.14442 -4.949737 2.451911
H  2.529618 -3.968697 1.796086
H  -5.279473 0.068776 -0.050458
H  -5.752776 1.825301 -0.060564
H  -6.440286 0.704276 1.191168
