program: Gaussian 09
title: 000267078
version: EM64L-G09RevD.01
frameworkgroup: C1[X(C19H18BrN4O2P)]
method: RPBEPBE
basis: SDD
operation: Freq
keyword: #p
keyword: freq=noraman
keyword: PBEPBE/SDD
title: #p freq=noraman PBEPBE/SDD
converged: YES YES NO NO
title: Mulliken charges:
elementType: Br P O O N N N N C C C C C C C C C C C C C C C C C C C H H H H H H H H H H H H H H H H H H
charge: 0.012678 1.357872 -0.599366 -0.334358 -0.811812 -0.920608 -0.784610 -0.472349 0.522160 0.534482 0.373368 -0.411762 -0.415908 -0.369232 -0.355933 0.485778 -0.194878 -0.194333 -0.216419 -0.215114 -0.257750 -0.261729 -0.435003 -0.323128 -0.150357 -0.161453 -0.238616 0.353917 0.407090 0.345391 0.225632 0.228193 0.292687 0.274542 0.309110 0.226624 0.224270 0.226177 0.225707 0.229338 0.227913 0.228154 0.310709 0.252328 0.250600
chargesum: 0.00000
title: Mulliken charges with hydrogens summed into heavy atoms:
elementType: Br P O O N N N N C C C C C C C C C C C C C C C C C C C
charge: 0.012678 1.357872 -0.599366 -0.334358 -0.457895 -0.513519 -0.439219 -0.163239 0.522160 0.534482 0.373368 -0.186130 -0.187715 -0.076544 -0.081390 0.485778 0.031746 0.029937 0.009758 0.010592 -0.028412 -0.033816 -0.206849 -0.012420 0.101971 0.089146 -0.238616
polarizability: 3.80130242e+02 -9.16017458e+00 2.98968778e+02 2.21723263e+01 3.79219054e+01 2.01423823e+02
1716.lowfreq: -4.8372 -1.2028 -0.3325 -0.0014 -0.0013 -0.0009 7.6587 12.5762 25.0900
frequency: 7.5265 12.5111 25.0717 30.2583 32.8460 34.5043 42.2510 70.9033 84.3875 93.0827 120.1590 133.7972 142.0529 168.1900 179.7798 203.2025 221.9705 240.4934 262.0390 275.9933 287.7372 313.0858 322.8801 342.8991 371.9396 403.0795 404.8981 409.8550 418.2349 428.9197 473.9898 489.5327 509.5015 517.0721 523.7509 574.6257 589.2421 607.6544 611.7374 613.6453 614.9935 622.7098 678.4443 695.0007 697.6558 706.5164 712.0495 731.4929 736.3981 760.1499 764.1827 776.2665 782.1761 815.4667 835.4855 839.5234 847.3392 857.5670 869.3578 892.5867 903.0661 910.2691 943.4658 965.7130 970.2435 982.6607 983.0717 983.4686 986.5078 989.4084 992.2746 1007.5475 1025.2015 1028.0721 1047.5387 1064.1163 1087.4554 1089.1835 1119.1466 1171.2273 1171.8068 1188.8111 1192.2582 1194.0238 1195.0780 1243.9555 1250.3021 1259.9588 1295.7460 1308.9048 1323.8392 1350.3158 1360.2683 1371.0821 1388.7162 1400.2683 1403.4776 1414.3438 1463.7988 1464.0478 1475.5236 1485.8338 1489.8765 1511.6492 1589.1290 1594.5135 1595.2547 1604.4423 1614.3647 1619.1853 1621.8640 3119.4698 3120.7504 3121.1895 3129.7089 3130.3941 3141.7978 3141.8927 3150.6707 3151.0233 3165.9743 3167.5941 3167.8156 3173.8563 3198.3771 3376.6121 3526.4455 3536.6451 3540.5459
redmass: 6.3826 7.1857 4.5030 3.8342 5.1855 4.6968 6.6649 6.4894 8.7772 5.8808 6.3666 6.0661 7.4224 11.4720 5.2497 5.0129 7.1696 5.9310 7.4353 6.4394 5.7085 4.9203 6.8999 5.6384 6.4601 2.9813 2.9821 2.9964 4.4480 2.1808 1.5823 2.2126 2.7277 2.6408 2.4051 6.7176 5.8511 1.7122 6.1674 6.2410 2.9116 7.0723 1.8362 1.9541 1.9988 3.2876 2.5125 6.1637 6.6377 1.9386 1.8211 4.5753 5.2217 1.3985 1.2550 1.2727 1.4108 5.3268 5.0211 3.2576 1.7708 1.4471 1.3613 1.3738 1.4035 3.1669 1.3581 3.9990 1.5910 5.0649 1.4255 5.9472 2.4621 2.1212 6.1539 2.4408 1.5710 1.5685 1.3534 1.0490 1.0501 1.1538 1.1659 1.1350 1.6792 2.1565 1.9988 2.0899 1.3544 1.6820 1.5964 2.3058 1.7498 3.1773 3.9326 3.3012 2.9851 2.0922 2.0710 2.0512 2.4205 2.3839 2.4550 2.4182 7.2302 5.0946 5.7731 5.9884 5.9807 5.9225 4.0199 1.0871 1.0865 1.0904 1.0868 1.0869 1.0923 1.0927 1.0962 1.0961 1.0911 1.1015 1.1015 1.0950 1.0951 1.0777 1.0774 1.0763 1.0762
irintensity: 0.4208 0.0741 1.3195 0.0975 0.5614 0.0133 0.1173 4.1598 1.4500 2.5858 3.2916 1.8772 4.1638 8.0369 4.2288 10.5995 1.0051 5.6256 3.2762 3.6689 15.6862 2.8125 3.9462 20.7498 19.3217 0.9679 1.4079 0.0670 25.6692 11.9341 93.0039 59.6535 18.8888 93.6531 18.0471 6.7513 14.6633 118.3514 4.9068 53.4448 77.4919 18.6448 17.0362 29.9268 35.8380 7.4866 66.7379 16.8696 17.6871 33.5433 56.5938 83.5041 181.7341 42.2379 0.9485 3.9330 55.7406 45.2101 125.4079 220.3328 140.8013 24.8046 1.8849 0.3193 0.1649 2.1620 3.0894 2.2584 3.0197 65.1163 2.9611 45.1753 19.1645 34.8764 74.8068 47.6668 19.1726 21.3582 16.2460 1.3522 0.7145 8.5716 27.2693 14.2892 196.5171 109.6946 25.3104 52.9734 26.8857 159.1545 71.0117 55.7178 93.5469 60.8990 222.3333 103.1451 165.9745 487.7247 79.3273 129.2696 91.1166 282.3877 269.8980 537.3566 74.3015 19.7826 11.2559 18.4561 221.2017 54.6059 53.8916 10.3950 10.6389 14.8885 1.9963 1.3633 13.6376 26.7729 11.2016 17.3170 3.0893 36.8716 19.1305 3.2571 8.8594 336.5496 20.0219 38.5242 28.9683
temp: 298.150 k
press: 1.00000 atm
elementType: 35 15 8 8 7 7 7 7 6 6 6 6 6 6 6 6 6 6 6 6 6 6 6 6 6 6 6 1 1 1 1 1 1 1 1 1 1 1 1 1 1 1 1 1 1
symmnumber: 1
zpe: 888727.9 jmol-1
zpe.correction: 0.338499 hartree
zpe.thermalcorrener: 0.363775 hartree
zpe.thermalcorrenthalpy: 0.364719 hartree
zpe.thermalcorrgfe: 0.277016 hartree
zpe.sumelectzpe: -1457.081427 hartree
zpe.sumelectthermal: -1457.056151 hartree
zpe.sumelectthermalent: -1457.055207 hartree
zpe.sumelectthermalfe: -1457.142910 hartree
dipole: -1.5465 2.0162 0.0450
dipole: 2.5413
quadrupole: -198.0808 -163.5613 -167.9059
quadrupole: -5.2989 -14.1810 10.2756
quadrupole: -21.5648 12.9548 8.6101 -5.2989 -14.1810 10.2756
hfenergy: -1457.4199259 hartree
pointgroup: C01 [X(C19H18Br1N4O2P1)]
dipole: 0.2094392 0.9486578 0.2363626 debye
polarizability: 327.3436206|27.1815737|322.57812|79.2790523|4.7276277|230.6011021 unknown
InChI: InChI=1S/C19H18BrN4O2P/c20-15-11-13-16(14-12-15)21-19(25)24-27(26,22-17-7-3-1-4-8-17)23-18-9-5-2-6-10-18/h1-14,21-24H
charge 0 multiplicity 1
45 atoms
Br 7.359734 2.343341 3.302034
P  -1.175923 -0.478706 -1.118436
O  -1.773165 -0.282345 -2.583103
O  1.270725 -0.515316 0.836741
N  -2.192667 0.05716 0.185821
N  -0.667998 -2.027901 -0.551434
N  0.33196 0.483984 -1.054326
N  2.211012 1.461534 -0.048403
C  -2.897495 1.291747 0.272028
C  -1.311039 -3.275259 -0.78161
C  1.282904 0.423584 -0.025791
C  -3.326777 1.745578 1.547914
C  -0.80123 -4.425487 -0.120961
C  -3.182147 2.069244 -0.882784
C  -2.434674 -3.399212 -1.641929
C  3.377888 1.611559 0.756132
C  -4.033437 2.961031 1.665375
C  -1.413553 -5.681166 -0.316642
C  -3.87449 3.291417 -0.746196
C  -3.037947 -4.661792 -1.82252
C  -4.30529 3.747025 0.521497
C  -2.537844 -5.809519 -1.164796
C  4.192761 2.748001 0.506963
C  3.749223 0.692398 1.772192
C  5.365896 2.970422 1.254967
C  4.927242 0.913426 2.517721
C  5.725135 2.045141 2.256659
H  -2.189217 -0.544449 1.013401
H  0.178105 -1.991665 0.039902
H  0.485349 1.058079 -1.888509
H  -3.10341 1.151262 2.442733
H  0.068535 -4.333036 0.540855
H  -2.897716 1.696215 -1.872577
H  -2.814568 -2.525028 -2.181724
H  2.028399 2.22926 -0.698189
H  -4.364132 3.296576 2.654773
H  -1.009695 -6.56044 0.198066
H  -4.094638 3.881666 -1.643072
H  -3.902876 -4.746723 -2.490064
H  -4.850441 4.691884 0.616117
H  -3.011428 -6.785413 -1.313721
H  3.917017 3.466132 -0.275534
H  3.116645 -0.173309 1.973796
H  5.986696 3.848265 1.056167
H  5.212375 0.203835 3.299665
