program: Gaussian 09
title: 000267075
version: EM64L-G09RevD.01
frameworkgroup: C1[X(C18H17N6O4P)]
method: RPBEPBE
basis: SDD
operation: Freq
keyword: #p
keyword: freq=noraman
keyword: PBEPBE/SDD
title: #p freq=noraman PBEPBE/SDD
converged: YES YES NO NO
title: Mulliken charges:
elementType: P O O O O N N N N N N C C C C C C C C C C C C C C C C C C H H H H H H H H H H H H H H H H H
charge: 1.375840 -0.583667 -0.326834 -0.205686 -0.199482 -0.813360 -0.933901 -0.758847 -0.438106 -0.182360 0.033396 0.516724 0.526540 0.304338 -0.413600 -0.414986 -0.357048 -0.348403 -0.196201 -0.193815 -0.217104 -0.215011 -0.258278 -0.261468 0.311506 -0.301571 -0.230669 0.358874 -0.384173 0.349686 0.406378 0.459549 0.221449 0.230534 0.292770 0.274261 0.354377 0.225353 0.224006 0.226602 0.226173 0.228918 0.227956 0.247084 0.300754 0.311502
chargesum: 0.00000
title: Mulliken charges with hydrogens summed into heavy atoms:
elementType: P O O O O N N N N N N C C C C C C C C C C C C C C C C C C
charge: 1.375840 -0.583667 -0.326834 -0.205686 -0.199482 -0.463675 -0.527523 -0.299298 -0.083729 -0.182360 0.033396 0.516724 0.526540 0.304338 -0.192151 -0.184452 -0.064278 -0.074142 0.029153 0.030192 0.009498 0.011161 -0.029359 -0.033512 0.311506 -0.054487 0.070085 0.358874 -0.072671
polarizability: 4.27568895e+02 3.98203735e+01 2.70921642e+02 -1.99623353e+01 -4.21254951e+01 2.18162011e+02
1716.lowfreq: -10.5094 -6.2643 -4.9948 -0.0013 -0.0011 -0.0010 3.8589 12.2512 25.2348
frequency: -4.7881 11.7262 24.9347 25.7373 26.8619 38.8882 48.7422 65.8602 75.7481 78.8879 110.1742 124.7571 153.7973 162.0084 168.0689 179.9776 209.3114 240.8614 258.8047 276.6208 285.4262 292.7905 292.8365 306.4279 341.8072 398.9351 403.8979 408.7854 421.2160 459.9105 476.2825 486.4364 504.0479 505.1900 511.0483 525.4138 572.0782 588.1582 609.9904 611.6652 614.5084 622.9518 640.3469 670.7089 674.8300 694.4416 696.7511 704.4399 727.6614 737.5325 757.8537 759.1687 763.2409 773.4160 780.9021 803.2191 834.3277 837.6753 839.6991 866.6459 875.2538 888.5347 901.2536 908.7113 955.4147 965.0662 968.5160 974.8154 982.6809 983.4213 986.2385 989.2416 992.5014 993.9907 1004.5155 1026.2406 1027.7928 1056.6286 1087.0453 1089.0875 1107.5503 1140.2684 1171.0031 1171.5688 1192.5692 1193.5275 1209.0774 1217.5332 1244.9851 1251.2827 1263.5811 1309.6682 1312.7900 1324.5258 1335.8329 1360.2340 1371.3276 1374.3979 1379.6190 1401.1384 1421.1405 1451.7055 1464.1035 1470.0557 1474.6851 1484.9227 1489.8957 1506.2221 1567.9334 1592.8725 1594.3254 1600.9194 1613.9757 1618.7500 1647.6099 2979.8933 3115.2893 3121.5756 3129.7306 3129.9297 3140.9446 3141.2355 3149.4458 3152.6019 3156.9717 3167.0660 3167.4594 3180.4866 3188.9057 3323.9229 3532.5044 3539.5598
redmass: 7.1744 6.6565 3.9064 4.9231 4.3127 7.5222 9.4772 9.9379 7.6265 6.7993 6.0302 6.1703 7.2100 7.2662 10.3166 5.3643 5.6591 6.5146 7.4881 7.1952 6.2407 5.7869 6.0052 11.1569 7.5168 4.4104 2.9195 3.6226 3.7859 8.5346 8.6425 1.4777 7.6334 3.1593 2.7805 2.2449 6.6478 6.5353 6.1861 6.3933 6.7515 1.3808 7.9605 8.5536 6.3369 1.8809 1.9918 1.4900 5.9573 2.3935 4.7127 2.3224 1.8208 3.4626 5.3005 7.2787 1.2532 1.2760 1.5335 5.0914 5.3307 3.6640 1.6380 1.4506 1.3685 1.3787 1.3796 1.2301 2.8173 4.4081 1.7581 4.0536 1.3840 1.3369 5.6786 2.2562 2.1249 8.1895 1.5726 1.5754 2.2531 1.7040 1.0491 1.0505 1.1177 1.1167 2.4688 4.4590 2.1488 1.9423 2.2716 1.6668 1.7285 1.4916 3.7035 1.7685 3.3186 10.1893 4.3312 3.0833 2.0977 2.3980 2.0717 1.7729 3.6806 2.3991 2.4125 1.6975 6.8518 5.8748 5.9125 6.5168 6.0075 6.0205 3.7009 1.0837 1.0874 1.0861 1.0866 1.0871 1.0927 1.0926 1.0964 1.0954 1.0915 1.1014 1.1015 1.0938 1.0966 1.0793 1.0759 1.0771
irintensity: 0.2081 0.0769 0.1786 0.5531 0.3779 0.1767 0.7415 2.4013 1.4372 1.4057 2.2674 2.3114 12.3884 0.2361 9.1147 3.6477 1.6169 6.5005 0.7246 7.8137 2.4898 3.3681 1.1568 4.9255 9.4117 88.4360 2.0519 49.7186 3.9470 80.6856 23.3849 88.6034 11.4191 15.5226 11.9582 17.8070 3.1293 13.5592 19.9838 0.4005 11.6655 52.8669 26.0171 6.0945 21.2385 33.9393 38.9460 3.4998 6.2487 78.5909 2.7207 5.4968 68.0480 199.4387 64.3561 18.5998 3.0128 2.6072 55.9982 35.7181 46.6400 163.9462 70.7928 24.1049 75.3002 0.3688 3.5542 72.6170 0.9358 5.4966 4.2554 7.8431 2.6263 3.5789 24.1827 12.6359 31.6460 77.9359 17.5046 18.3161 34.3196 66.8964 1.0379 0.7500 2.7579 1.6048 619.7355 421.6311 86.8198 11.1278 281.1710 130.9775 18.5939 34.1264 17.0111 64.8717 128.6469 92.0596 46.8836 38.8758 137.4324 152.8206 20.5939 186.6393 215.5341 259.5685 318.5661 465.8720 53.5496 56.4741 11.8478 257.3973 212.1732 49.5878 354.6441 856.6502 10.8913 9.3182 0.9547 1.3498 23.7502 18.1977 21.2524 6.7265 3.1194 32.8080 24.1459 2.1862 4.5323 350.8754 29.0672 77.9436
temp: 298.150 k
press: 1.00000 atm
elementType: 15 8 8 8 8 7 7 7 7 7 7 6 6 6 6 6 6 6 6 6 6 6 6 6 6 6 6 6 6 1 1 1 1 1 1 1 1 1 1 1 1 1 1 1 1 1
symmnumber: 1
zpe: 887572.3 jmol-1
zpe.correction: 0.338058 hartree
zpe.thermalcorrener: 0.363053 hartree
zpe.thermalcorrenthalpy: 0.363998 hartree
zpe.thermalcorrgfe: 0.279302 hartree
zpe.sumelectzpe: -1664.643718 hartree
zpe.sumelectthermal: -1664.618723 hartree
zpe.sumelectthermalent: -1664.617779 hartree
zpe.sumelectthermalfe: -1664.702474 hartree
dipole: 0.5533 -2.5659 5.9135
dipole: 6.4699
quadrupole: -194.9556 -163.8615 -176.7407
quadrupole: -12.9860 13.0359 -5.1243
quadrupole: -16.4363 14.6578 1.7786 -12.9860 13.0359 -5.1243
hfenergy: -1664.9817765 hartree
pointgroup: C01 [X(C18H17N6O4P1)]
dipole: 1.3459261 -1.4269484 1.6222447 debye
polarizability: 321.6855368|69.4864032|397.2120424|17.7225268|18.3694375|197.7549686 unknown
InChI: InChI=1S/C18H17N6O4P/c25-18(20-17-12-11-16(13-19-17)24(26)27)23-29(28,21-14-7-3-1-4-8-14)22-15-9-5-2-6-10-15/h1-13,20-23H
charge 0 multiplicity 1
46 atoms
P  -1.24619 -0.662562 -0.497557
O  -1.720117 0.312065 -1.663768
O  1.277188 -2.399875 0.583642
O  5.6511 5.017798 -0.012556
O  3.548976 5.519499 -0.76286
N  -2.155587 -0.486151 0.978149
N  -1.213007 -2.379583 -0.677515
N  0.475871 -0.302765 -0.154375
N  2.718375 -0.59005 0.571185
N  2.282008 1.63061 -0.132779
N  4.428978 4.700236 -0.291007
C  -2.600363 0.717593 1.595513
C  -2.248755 -3.182436 -1.229096
C  1.427974 -1.159547 0.336575
C  -3.002621 0.669161 2.957829
C  -2.108246 -4.595404 -1.173022
C  -2.656673 1.950369 0.890717
C  -3.406566 -2.614741 -1.825359
C  -3.457438 1.837195 3.60482
C  -3.11697 -5.42626 -1.704123
C  -3.09923 3.112891 1.557481
C  -4.408749 -3.459991 -2.346576
C  -3.501846 3.069496 2.912553
C  -4.276029 -4.866848 -2.290443
C  3.170065 0.711864 0.371035
C  4.52126 1.05818 0.683144
C  4.945612 2.372753 0.467154
C  4.01529 3.307781 -0.052329
C  2.695434 2.904597 -0.340346
H  -2.303585 -1.356555 1.496323
H  -0.346882 -2.831871 -0.334946
H  0.822399 0.679253 -0.329276
H  -2.957847 -0.279982 3.506957
H  -1.213889 -5.035637 -0.715764
H  -2.392772 1.98168 -0.171513
H  -3.509306 -1.526924 -1.905464
H  3.383639 -1.28199 0.92642
H  -3.770635 1.7833 4.653641
H  -2.995508 -6.514449 -1.656391
H  -3.144027 4.058006 1.004329
H  -5.296248 -3.011547 -2.807058
H  -3.851084 3.97617 3.417432
H  -5.057572 -5.514773 -2.700607
H  5.20923 0.307393 1.083727
H  5.966579 2.694904 0.68713
H  1.967664 3.613945 -0.742428
