program: Gaussian 09
title: 000267039
version: EM64L-G09RevD.01
frameworkgroup: C1[X(C19H20N4O4)]
method: RPBEPBE
basis: SDD
operation: Freq
keyword: #p
keyword: freq=noraman
keyword: PBEPBE/SDD
title: #p freq=noraman PBEPBE/SDD
converged: YES YES NO NO
title: Mulliken charges:
elementType: O O O O N N N N C C C C C C C C C C C C C C C C C C C H H H H H H H H H H H H H H H H H H H H
charge: -0.225248 -0.215357 -0.456059 -0.490694 -0.393701 -0.381953 0.045003 0.045686 -0.379056 -0.548658 -0.536857 0.255306 0.232522 0.481941 0.488638 -0.391746 -0.393422 -0.527852 -0.529601 -0.414544 -0.417648 0.249656 0.306313 -0.182675 -0.180967 -0.360339 -0.368644 0.232496 0.239945 0.237315 0.248994 0.239613 0.234255 0.294781 0.309767 0.214298 0.217563 0.251581 0.250160 0.278821 0.286831 0.231655 0.236550 0.255558 0.260734 0.389360 0.379682
chargesum: 0.00000
title: Mulliken charges with hydrogens summed into heavy atoms:
elementType: O O O O N N N N C C C C C C C C C C C C C C C C C C C
charge: -0.225248 -0.215357 -0.066699 -0.111013 -0.098920 -0.072185 0.045003 0.045686 0.093384 -0.062349 -0.062990 0.255306 0.232522 0.481941 0.488638 -0.177448 -0.175859 -0.276271 -0.279441 -0.135723 -0.130817 0.249656 0.306313 0.048981 0.055582 -0.104781 -0.107910
polarizability: 4.46182350e+02 1.41560568e+01 2.33147933e+02 -7.78454135e+00 5.32728010e+01 1.59329678e+02
1716.lowfreq: -6.3847 -0.9321 -0.0002 0.0004 0.0008 6.5806 26.0624 30.6376 33.1750
frequency: 25.5682 30.5549 33.1254 41.2645 47.1963 60.3322 61.3756 81.6467 108.6047 120.6096 132.0466 151.7954 158.9245 186.7463 201.6728 218.3133 229.3767 231.8189 236.1143 243.8179 252.3852 260.1895 297.5157 322.7444 331.3908 359.4417 376.8524 393.8516 427.3078 443.7420 449.8386 451.3450 471.0312 493.3882 513.7539 516.8765 564.1417 583.7888 595.1230 602.3151 625.4163 641.8172 647.8931 652.6816 662.3084 668.3349 692.6492 695.5909 734.2574 771.2428 781.3676 795.7256 807.2969 809.1810 855.2929 861.3593 865.4497 908.3903 911.3058 916.6373 924.0431 949.0210 952.4101 960.0240 964.2436 981.2842 983.0250 984.3273 987.3523 994.1173 1012.0886 1045.3056 1073.2933 1077.3560 1081.2420 1110.3359 1129.3243 1137.6217 1144.7943 1166.1728 1170.5157 1177.7614 1189.6073 1199.1530 1211.1277 1224.6541 1259.5576 1276.2903 1296.0015 1312.4112 1315.2794 1317.0607 1341.4164 1344.7710 1349.7813 1355.0019 1397.6100 1400.6770 1426.7432 1430.0545 1448.7484 1455.6556 1470.1496 1486.4310 1491.9407 1499.9669 1505.3730 1571.7099 1573.8866 1602.1653 1605.3013 1609.1828 1613.3650 1634.8003 1644.6291 2968.0377 2975.0044 2985.4547 3008.9044 3018.1994 3040.2852 3070.5851 3087.2887 3119.7161 3125.8345 3140.4735 3144.5539 3167.3756 3168.4947 3177.1612 3178.8831 3373.1932 3375.3137 3422.1366 3571.1411
redmass: 7.1752 5.1313 5.7987 6.8144 6.7261 5.3766 7.2388 5.9278 5.2684 6.5738 5.6715 4.7963 5.7557 4.6599 5.1341 3.3522 3.3813 3.5204 2.8013 3.9786 3.9458 3.7949 1.3422 4.7641 4.7749 5.0409 4.5288 2.9075 3.2128 3.9323 3.1562 2.9690 4.8593 5.5221 7.2383 7.1721 3.4797 3.5821 3.5979 4.2346 1.4095 2.2545 3.1976 1.9085 2.0213 1.6031 2.0637 2.0760 4.1634 6.0758 4.6775 2.1348 1.4151 1.4081 1.6072 3.2129 1.5410 4.0975 1.3897 1.3727 3.3282 1.5788 1.5901 2.9686 2.6648 3.4820 5.9678 5.7841 1.3579 1.3404 2.7318 2.7823 2.0729 1.7003 2.1048 3.3799 1.8608 1.6236 1.7417 1.2698 1.0954 1.4445 1.3316 1.5540 1.3101 1.6008 1.2981 2.4868 2.3091 1.4126 1.3767 1.3850 1.5420 1.5862 1.4111 1.4627 5.9282 5.5934 2.8296 2.8691 1.0819 1.1037 1.1640 1.9139 2.1129 2.2874 2.0274 5.8587 5.7180 5.5920 6.1537 5.6072 6.4739 6.6580 6.7785 1.0867 1.0872 1.0597 1.0597 1.0635 1.0987 1.1014 1.1047 1.0917 1.0912 1.0876 1.0877 1.0925 1.0929 1.0986 1.0987 1.0763 1.0757 1.0669 1.0659
irintensity: 9.7277 5.4276 0.1222 2.1445 5.9766 0.0425 0.8751 0.1881 13.0031 3.4590 9.1520 6.3392 5.0676 1.1130 8.1264 5.7695 4.0872 53.9915 5.3883 4.6501 6.9241 3.0516 339.0415 0.6092 4.8010 11.1322 35.7629 5.5506 2.9315 6.2351 7.9612 13.0412 2.9420 9.7751 4.1738 4.3195 13.9732 23.5732 7.2274 8.2490 138.9064 1.5573 19.9318 30.4948 41.7248 71.8656 38.1555 44.1614 15.4141 0.7030 6.7818 20.7413 59.7888 6.5823 48.3940 4.4897 10.4339 14.3357 0.3149 1.1647 14.6520 58.2851 35.0377 13.4136 25.9372 21.2523 0.5367 1.8129 3.6399 3.1064 2.8042 10.8067 22.2901 25.3440 0.7497 3.3747 356.6565 160.4823 134.4065 39.0557 0.3283 70.7553 11.5583 4.6429 96.5609 253.0755 6.0225 25.5328 28.6784 7.9547 25.4595 12.4921 8.1196 14.3608 6.4149 29.6072 5.1584 15.0019 39.6816 46.3499 7.7346 32.3517 93.4847 19.3909 121.8578 15.8419 289.7231 20.6503 37.9653 29.1315 25.4873 25.7541 16.5012 221.6777 219.4846 44.2886 42.0875 14.6148 16.1045 25.6736 23.9851 19.6521 21.8697 10.2566 7.8392 11.6590 9.8389 1.9410 0.7447 11.1972 7.6355 0.8265 6.9584 228.2928 42.1445
temp: 298.150 k
press: 1.00000 atm
elementType: 8 8 8 8 7 7 7 7 6 6 6 6 6 6 6 6 6 6 6 6 6 6 6 6 6 6 6 1 1 1 1 1 1 1 1 1 1 1 1 1 1 1 1 1 1 1 1
symmnumber: 1
zpe: 954598.0 jmol-1
zpe.correction: 0.363587 hartree
zpe.thermalcorrener: 0.388864 hartree
zpe.thermalcorrenthalpy: 0.389808 hartree
zpe.thermalcorrgfe: 0.307105 hartree
zpe.sumelectzpe: -1253.926574 hartree
zpe.sumelectthermal: -1253.901297 hartree
zpe.sumelectthermalent: -1253.900353 hartree
zpe.sumelectthermalfe: -1253.983056 hartree
dipole: 1.1894 0.7224 -0.1307
dipole: 1.3977
quadrupole: -166.8646 -173.5419 -146.0884
quadrupole: 11.9475 -6.2220 2.1789
quadrupole: -4.6996 -11.3770 16.0766 11.9475 -6.2220 2.1789
hfenergy: -1254.2901607 hartree
pointgroup: C01 [X(C19H20N4O4)]
dipole: 0.5343993 0.1259254 -0.0308521 debye
polarizability: 433.1246885|-53.2642735|244.1675089|18.4706161|52.0083983|161.3677639 unknown
InChI: InChI=1S/C19H20N4O4/c24-16-6-1-4-14(10-16)12-20-22-18(26)8-3-9-19(27)23-21-13-15-5-2-7-17(25)11-15/h1-2,4-7,10-13,22-25H,3,8-9H2
charge 0 multiplicity 1
47 atoms
O  -3.951638 -1.489404 -0.604383
O  -3.599988 3.453087 0.045304
O  4.760882 -2.379406 0.411439
O  4.704958 0.370319 -0.302876
N  -2.281625 -0.79589 0.89479
N  -2.309283 1.8782 -1.131512
N  -1.322933 -1.672717 0.407154
N  -1.101058 2.301656 -0.611449
C  -5.456697 0.966203 0.059794
C  -4.498711 0.253968 1.048406
C  -4.748526 1.637532 -1.15534
C  -3.582818 -0.765462 0.358428
C  -3.53002 2.442646 -0.699613
C  1.003138 -2.383962 0.399207
C  1.291488 1.943301 -0.409644
C  -0.092219 -1.515319 0.852647
C  -0.024336 1.642294 -0.989193
C  2.337918 -1.993072 0.695129
C  2.377739 1.082834 -0.724818
C  0.765732 -3.575246 -0.341764
C  1.489933 3.009678 0.513592
C  3.42576 -2.758851 0.213815
C  3.626214 1.271069 -0.095588
C  1.860064 -4.356439 -0.767428
C  2.751495 3.189951 1.114148
C  3.190132 -3.957882 -0.501483
C  3.830502 2.319822 0.82449
H  -6.014154 1.735181 0.62359
H  -6.184803 0.235342 -0.334055
H  -3.906825 1.005884 1.605494
H  -5.106706 -0.290595 1.79754
H  -5.458584 2.328559 -1.643292
H  -4.471971 0.859872 -1.89047
H  -2.033278 -0.101257 1.617079
H  -2.347341 1.049534 -1.74639
H  0.178864 -0.706555 1.56328
H  -0.068929 0.800371 -1.710228
H  2.521575 -1.084187 1.281712
H  2.228291 0.24351 -1.416595
H  -0.265173 -3.866275 -0.562754
H  0.647311 3.666431 0.748786
H  1.681856 -5.283474 -1.323207
H  2.904746 4.012441 1.820844
H  4.046451 -4.546519 -0.843866
H  4.812382 2.444121 1.290143
H  4.83154 -1.414699 0.659145
H  4.613247 -0.105994 -1.166515
