program: Gaussian 09
title: 000267022
version: EM64L-G09RevD.01
frameworkgroup: C1[X(C19H16Cl4N4O2)]
method: RPBEPBE
basis: SDD
operation: Freq
keyword: #p
keyword: freq=noraman
keyword: PBEPBE/SDD
title: #p freq=noraman PBEPBE/SDD
converged: YES YES NO NO
title: Mulliken charges:
elementType: Cl Cl Cl Cl O O N N N N C C C C C C C C C C C C C C C C C C C H H H H H H H H H H H H H H H H
charge: -0.002170 -0.005001 0.008753 0.000018 -0.235734 -0.215515 -0.395018 -0.384402 0.031458 0.043319 -0.374398 -0.565129 -0.535809 0.276137 0.223041 0.506468 0.491054 -0.374855 -0.387667 -0.367995 -0.364903 -0.398667 -0.388776 -0.064719 -0.073901 -0.190840 -0.192296 -0.099324 -0.102737 0.235996 0.229714 0.253843 0.245817 0.241008 0.239065 0.295835 0.324661 0.219534 0.226396 0.257435 0.263363 0.290649 0.291306 0.263332 0.261656
chargesum: 0.00000
title: Mulliken charges with hydrogens summed into heavy atoms:
elementType: Cl Cl Cl Cl O O N N N N C C C C C C C C C C C C C C C C C C C
charge: -0.002170 -0.005001 0.008753 0.000018 -0.235734 -0.215515 -0.099183 -0.059740 0.031458 0.043319 0.091312 -0.065470 -0.055736 0.276137 0.223041 0.506468 0.491054 -0.155321 -0.161271 -0.110560 -0.101540 -0.108018 -0.097469 -0.064719 -0.073901 0.072492 0.069359 -0.099324 -0.102737
polarizability: 5.39968400e+02 2.30785770e+01 2.19012706e+02 -6.34010019e+00 5.00899164e+01 1.97686306e+02
1716.lowfreq: -3.2696 -0.6050 0.0015 0.0016 0.0022 3.5085 9.5526 14.3417 20.1065
frequency: 9.5401 14.3209 20.0924 23.3527 29.8721 44.6159 49.4162 54.0683 62.9153 90.3414 111.4633 124.8346 126.8744 150.0427 152.4862 167.7013 173.5855 179.1567 188.0083 207.0879 211.6556 223.9904 228.1640 239.5856 262.7939 280.1477 308.6115 313.6579 358.0298 365.4350 379.0955 395.0364 397.1198 419.2292 439.3158 441.5193 444.4644 446.7642 451.9148 529.9357 546.5259 567.5353 576.7073 583.9490 612.2674 645.5086 649.6856 652.7190 658.8628 681.0072 707.0281 708.2029 716.8929 718.8497 747.4212 789.8963 839.2565 839.5595 851.0417 863.2772 876.5084 878.4550 881.0000 944.1077 946.0497 950.4879 952.3297 979.5728 982.8901 983.3876 1000.9203 1001.8682 1018.4210 1051.3362 1078.3057 1115.1369 1118.6750 1119.8753 1136.9296 1142.2355 1143.7228 1155.7907 1190.5412 1224.4651 1227.1280 1234.2336 1259.0149 1269.0542 1271.7086 1317.0060 1326.0438 1330.9367 1352.1868 1355.5213 1374.5375 1375.7605 1386.4779 1387.0963 1442.6755 1456.9795 1461.4288 1462.0407 1470.9736 1498.9083 1510.1520 1549.6563 1551.3773 1585.1117 1587.2785 1595.2665 1595.5630 1629.7469 1645.9626 2978.6101 2981.1175 2989.7519 3014.4041 3023.0653 3033.4687 3074.0145 3090.8712 3148.3564 3151.1489 3158.6223 3159.2928 3177.1837 3177.7792 3361.2145 3379.5429
redmass: 12.8018 10.9677 11.0139 12.0186 10.6758 8.8463 7.0979 7.9506 8.9317 6.3878 6.2206 5.1198 5.6557 4.7117 5.5972 9.6619 13.4956 8.4235 7.0624 3.6712 6.0050 3.9415 4.3960 5.4313 4.2793 3.9429 8.6760 8.5353 4.5801 4.9085 4.9387 9.0494 9.2035 3.7095 3.1272 3.1933 5.8532 6.3847 5.2491 5.4756 4.3094 4.7273 4.6229 4.4745 5.3160 1.6528 2.3556 6.0159 3.7466 1.2275 3.3914 3.3341 5.6140 6.8309 4.3233 1.9974 1.3424 1.3360 4.3941 5.0119 1.4643 1.4649 3.4469 1.6009 2.6994 3.4946 1.5939 3.0200 1.3766 1.4053 5.2096 5.1266 2.8193 3.0256 3.4757 3.5684 2.3697 2.3207 2.0015 1.3119 1.3242 2.0017 1.4601 1.6223 1.6035 1.5489 1.2857 1.7116 1.7848 1.3406 1.9019 2.0221 1.3810 1.4469 2.8056 2.5862 4.4619 4.6137 1.0979 1.1090 2.5034 2.3877 1.1920 1.9085 1.7476 8.1639 8.4177 5.1974 5.7235 6.5665 6.6903 6.3611 6.1589 1.0598 1.0874 1.0875 1.0618 1.0623 1.0966 1.1027 1.1045 1.0922 1.0921 1.0886 1.0886 1.0976 1.0976 1.0768 1.0758
irintensity: 0.1589 0.7454 0.0860 0.5119 0.3175 6.4951 0.5788 2.0485 7.4481 18.0612 0.3114 11.5597 2.0715 1.4882 0.1242 1.6108 1.4611 3.3403 3.4333 2.1601 5.6979 24.7804 2.6426 19.5792 8.7799 7.0864 1.4666 1.8551 1.6370 2.6993 4.1659 3.0145 1.6419 12.4157 6.4166 7.4936 0.4499 1.5110 5.0315 2.6308 4.2991 11.6404 3.9501 12.3852 28.9606 59.5890 36.0138 20.9352 17.2991 121.3550 15.5899 5.5787 14.0738 12.4495 7.9156 20.6878 12.0079 41.1935 5.8126 39.9172 15.1745 4.6018 19.6631 63.2048 18.2628 4.5523 41.8416 11.4044 6.4825 1.8744 32.9702 33.3139 2.1356 10.3654 1.7605 2.9299 9.3495 172.9799 431.5858 1.0409 0.8718 99.2166 13.1660 16.8678 72.8869 210.6959 4.4574 21.2678 48.4778 23.7987 19.9009 11.1621 4.6909 25.2865 1.4950 1.3706 10.5471 11.2924 23.4949 15.6902 8.5622 272.4737 49.8207 59.1123 331.0424 11.5917 15.4236 0.2293 1.1381 10.9447 15.5175 217.8014 206.0111 13.5391 40.3291 43.8913 26.6463 17.2466 26.9211 15.0987 23.8749 1.7445 1.2365 0.3035 0.4658 1.0470 1.4979 6.4795 4.8024
temp: 298.150 k
press: 1.00000 atm
elementType: 17 17 17 17 8 8 7 7 7 7 6 6 6 6 6 6 6 6 6 6 6 6 6 6 6 6 6 6 6 1 1 1 1 1 1 1 1 1 1 1 1 1 1 1 1
symmnumber: 1
zpe: 833520.3 jmol-1
zpe.correction: 0.317471 hartree
zpe.thermalcorrener: 0.345917 hartree
zpe.thermalcorrenthalpy: 0.346861 hartree
zpe.thermalcorrgfe: 0.252734 hartree
zpe.sumelectzpe: -2941.188790 hartree
zpe.sumelectthermal: -2941.160344 hartree
zpe.sumelectthermalent: -2941.159399 hartree
zpe.sumelectthermalfe: -2941.253527 hartree
dipole: -3.1709 -2.7490 1.7567
dipole: 4.5495
quadrupole: -211.6042 -209.6043 -182.6820
quadrupole: 12.0619 -5.1892 -3.6556
quadrupole: -10.3073 -8.3075 18.6148 12.0619 -5.1892 -3.6556
hfenergy: -2941.5062608 hartree
pointgroup: C01 [X(C19H16Cl4N4O2)]
dipole: 1.498549 -0.6937716 0.690471 debye
polarizability: 297.3413736|-136.4718822|465.2347076|-46.5034732|-18.3709395|194.0913302 unknown
InChI: InChI=1S/C19H16Cl4N4O2/c20-14-6-4-12(8-16(14)22)10-24-26-18(28)2-1-3-19(29)27-25-11-13-5-7-15(21)17(23)9-13/h4-11,26-27H,1-3H2
charge 0 multiplicity 1
45 atoms
Cl -0.88727 5.396938 1.941702
Cl -3.330271 3.22025 -0.92802
Cl 0.199619 6.313027 -1.025981
Cl -5.819357 1.696545 0.598903
O  3.596262 -2.127491 -0.818055
O  0.182172 -5.236827 0.132973
N  2.437971 -1.329672 1.056803
N  0.562751 -3.238689 -1.053965
N  2.213144 -0.083448 0.503146
N  -0.614003 -2.635603 -0.65623
C  3.346622 -4.8845 0.140336
C  3.206476 -3.660763 1.081753
C  2.32744 -4.932328 -1.040361
C  3.127305 -2.324128 0.336015
C  0.918115 -4.528965 -0.601617
C  1.233923 2.120495 0.669913
C  -2.005787 -0.655736 -0.617189
C  1.533862 0.791457 1.215504
C  -0.78757 -1.376184 -1.005027
C  0.442825 3.018003 1.434243
C  -2.107509 0.730206 -0.910889
C  1.705705 2.529274 -0.610958
C  -3.08339 -1.30361 0.052658
C  0.125484 4.293022 0.929283
C  -3.258631 1.451638 -0.542631
C  1.384763 3.80244 -1.109776
C  -4.230972 -0.578405 0.413795
C  0.591651 4.688271 -0.342654
C  -4.323018 0.802281 0.117807
H  4.362372 -4.904188 -0.292564
H  3.228603 -5.791315 0.760301
H  4.081342 -3.633642 1.761909
H  2.310187 -3.786827 1.72064
H  2.690559 -4.281931 -1.854703
H  2.277701 -5.966904 -1.42211
H  2.051151 -1.570827 1.982855
H  1.260702 -2.71061 -1.603819
H  1.148495 0.565519 2.230289
H  -0.031704 -0.809019 -1.584215
H  0.064945 2.726862 2.420143
H  -1.28967 1.252314 -1.419514
H  2.325817 1.840009 -1.191457
H  -3.000913 -2.371208 0.275829
H  1.744243 4.125819 -2.091033
H  -5.065244 -1.069051 0.92367
