program: Gaussian 09
title: 000267021
version: EM64L-G09RevD.01
frameworkgroup: C1[X(C21H20N4O6)]
method: RPBEPBE
basis: SDD
operation: Freq
keyword: #p
keyword: freq=noraman
keyword: PBEPBE/SDD
title: #p freq=noraman PBEPBE/SDD
converged: YES YES NO NO
title: Mulliken charges:
elementType: O O O O O O N N N N C C C C C C C C C C C C C C C C C C C C C H H H H H H H H H H H H H H H H H H H H
charge: -0.261931 -0.260594 -0.258509 -0.255618 -0.220170 -0.232195 -0.381818 -0.393574 0.034180 0.026904 -0.375340 -0.539276 -0.559560 0.218491 0.220619 0.169568 0.171955 0.220340 0.261681 0.500689 0.510472 -0.499266 -0.503766 -0.340490 -0.336027 -0.378935 -0.383914 -0.203930 -0.203851 -0.400567 -0.384905 0.228457 0.234887 0.239476 0.235959 0.249535 0.242565 0.305394 0.305887 0.255059 0.256807 0.237317 0.233621 0.242084 0.237085 0.239198 0.244661 0.318584 0.292566 0.224598 0.215597
chargesum: 0.00000
title: Mulliken charges with hydrogens summed into heavy atoms:
elementType: O O O O O O N N N N C C C C C C C C C C C C C C C C C C C C C
charge: -0.261931 -0.260594 -0.258509 -0.255618 -0.220170 -0.232195 -0.063235 -0.101009 0.034180 0.026904 0.088005 -0.063841 -0.067460 0.218491 0.220619 0.169568 0.171955 0.220340 0.261681 0.500689 0.510472 -0.193872 -0.197879 -0.085431 -0.079221 -0.141618 -0.150293 0.275239 0.280008 -0.175969 -0.169308
polarizability: 4.71060895e+02 6.41005982e+01 3.13805736e+02 -2.08402562e+01 5.47878014e+01 1.79110928e+02
1716.lowfreq: -5.5397 -0.0008 -0.0005 -0.0004 3.0797 3.2531 5.4198 12.9012 21.4103
frequency: 3.3477 12.8065 21.3992 24.1209 31.4691 49.6065 52.9978 55.3374 59.6426 71.4841 82.5218 103.3368 123.7944 138.0200 146.5351 177.5328 197.8604 208.6955 213.7939 214.9230 223.7130 226.5615 240.1025 255.9248 284.3614 298.2946 357.0052 365.0893 369.3084 370.7168 385.5176 420.4169 433.3555 436.1986 441.1579 473.2461 487.9838 550.7924 555.2618 581.1232 603.9818 609.9314 611.8607 613.7658 623.8872 637.3864 654.4491 668.9039 678.4444 679.3073 722.5349 722.6874 736.8732 763.8918 767.6134 787.9862 789.1027 796.0560 807.1319 813.3578 837.6397 838.4499 862.1333 907.5116 908.1112 911.0377 922.2371 925.7203 928.4314 947.6919 951.5318 955.4536 957.1638 973.8211 978.0288 985.7378 1014.2344 1046.2051 1060.1126 1061.4790 1068.1602 1069.4032 1070.6893 1105.9089 1124.6258 1125.6163 1128.0943 1134.7464 1142.2457 1151.9077 1187.8787 1193.3324 1200.3215 1228.3475 1255.6842 1257.2252 1260.4639 1261.7622 1262.3941 1315.1160 1336.1091 1340.4172 1349.2438 1353.5172 1364.4105 1364.5330 1393.7633 1394.4866 1445.5761 1454.3029 1455.4882 1456.5341 1470.4999 1472.1669 1475.9742 1484.8675 1485.3257 1504.5899 1513.3592 1571.3206 1573.3905 1606.8235 1606.8792 1622.8841 1623.0842 1630.4687 1642.1359 2977.1074 2977.6251 2982.9477 3006.3164 3010.6821 3012.7398 3019.9210 3032.1401 3073.5821 3088.7552 3107.5545 3108.9255 3139.3454 3140.2244 3182.2676 3183.8110 3185.1472 3186.1116 3368.7179 3380.9446
redmass: 5.8865 6.7178 7.1951 7.0489 5.6229 6.2385 6.5347 7.4348 4.9031 2.6670 2.7938 5.5981 7.0710 7.4981 5.0013 4.7558 4.6565 3.3993 4.3495 5.7808 3.3253 3.5204 6.5079 5.5804 5.2388 4.6165 4.9926 6.5331 5.2889 4.7406 4.1351 3.2638 3.7777 3.1729 3.8417 5.3292 5.7376 4.1499 4.7052 4.7916 4.4777 3.6503 4.7326 7.0682 4.6142 1.3644 2.4069 1.3257 9.3106 8.8648 4.4492 4.3908 4.3025 6.6821 6.3547 4.5511 3.7201 2.5551 1.3824 1.3697 9.6701 9.4349 3.4200 1.3585 1.3629 4.5343 3.7410 1.3924 1.3726 1.5428 2.7271 2.9556 1.7340 4.7020 3.8782 3.0091 2.9484 2.7442 3.9304 3.8471 1.4917 1.5681 3.2210 2.8628 1.0649 1.0862 1.4980 1.5981 1.5400 1.6747 1.5882 1.7806 1.7731 1.6475 1.8610 1.6403 1.8574 1.5756 1.9215 1.3714 1.6995 1.7209 1.4183 1.4682 1.2832 1.2811 3.4500 3.5869 1.0931 3.5877 3.2561 1.2274 1.3944 2.3184 1.7735 1.2675 1.2543 2.0648 1.8682 5.8233 6.3756 7.5070 7.4831 7.9024 7.8536 6.3815 6.3624 1.0656 1.0810 1.0874 1.0592 1.0584 1.0616 1.0622 1.0971 1.1023 1.1045 1.1123 1.1134 1.0900 1.0901 1.0950 1.0945 1.0943 1.0947 1.0765 1.0757
irintensity: 1.2338 0.6165 0.5703 1.5671 0.4461 1.8011 0.3288 3.9728 2.1144 29.6964 16.9140 9.6463 3.3920 2.2276 6.7740 8.9714 6.0254 15.3338 1.0857 0.0785 9.4235 1.8762 1.6450 12.4919 7.5279 8.7566 3.5679 0.7216 0.3442 3.2470 5.1365 13.6212 3.3584 5.7338 2.8125 4.4028 1.1450 7.9355 1.4881 10.0143 4.3965 4.2897 3.0895 14.8531 48.8277 127.2755 21.4006 58.9449 0.3417 0.2659 7.0448 0.9813 9.1489 24.4473 0.6322 16.0207 9.9255 21.6463 72.6194 2.9613 23.4458 22.0297 11.3609 0.6092 10.1191 0.4610 12.8261 35.4038 9.5182 46.7702 0.5218 19.7827 27.6296 53.6841 208.7516 76.5983 6.2877 11.4503 3.8925 4.9785 5.5155 7.7737 42.0492 3.3829 6.8643 16.5379 299.9092 11.6756 136.4677 97.1866 60.2581 52.2188 39.7638 189.7889 133.2142 69.0574 197.3121 147.1570 84.7236 25.3606 29.9010 15.6224 7.4888 19.4912 0.3971 0.3769 36.5639 40.8307 16.4662 127.7548 119.1988 7.8154 225.0373 113.7382 39.9086 31.9944 23.9588 30.9909 262.0942 17.2930 38.1650 0.4887 0.3572 57.9351 15.2445 197.4044 214.6778 13.2623 46.4144 54.8235 144.7235 137.7288 25.1292 17.9520 29.8301 18.5658 25.8234 29.1408 27.3502 8.5985 8.6280 2.2657 0.9512 4.9714 6.3799 4.1240 7.4542
temp: 298.150 k
press: 1.00000 atm
elementType: 8 8 8 8 8 8 7 7 7 7 6 6 6 6 6 6 6 6 6 6 6 6 6 6 6 6 6 6 6 6 6 1 1 1 1 1 1 1 1 1 1 1 1 1 1 1 1 1 1 1 1
symmnumber: 1
zpe: 1007902.8 jmol-1
zpe.correction: 0.383890 hartree
zpe.thermalcorrener: 0.412087 hartree
zpe.thermalcorrenthalpy: 0.413031 hartree
zpe.thermalcorrgfe: 0.318678 hartree
zpe.sumelectzpe: -1480.255050 hartree
zpe.sumelectthermal: -1480.226853 hartree
zpe.sumelectthermalent: -1480.225909 hartree
zpe.sumelectthermalfe: -1480.320262 hartree
dipole: 4.9220 -0.0302 2.0728
dipole: 5.3407
quadrupole: -179.3675 -175.8070 -167.6410
quadrupole: 9.3047 -8.2002 1.4417
quadrupole: -5.0957 -1.5352 6.6308 9.3047 -8.2002 1.4417
hfenergy: -1480.6389398 hartree
pointgroup: C01 [X(C21H20N4O6)]
dipole: 0.8437345 1.7229852 0.8570266 debye
polarizability: 290.5856328|21.0403062|491.49518|-59.8620204|14.0833814|181.896746 unknown
InChI: InChI=1S/C21H20N4O6/c26-20(24-22-10-14-4-6-16-18(8-14)30-12-28-16)2-1-3-21(27)25-23-11-15-5-7-17-19(9-15)31-13-29-17/h4-11,24-25H,1-3,12-13H2
charge 0 multiplicity 1
51 atoms
O  -5.229235 1.997922 0.670567
O  4.844065 2.419761 -1.390027
O  -4.035747 4.059912 0.388454
O  4.263847 4.469214 -0.285349
O  -2.831885 -4.541708 -0.457468
O  2.013745 -3.903428 -0.464283
N  -1.228768 -3.008225 -1.24541
N  1.071218 -2.477784 1.142304
N  -1.954994 -1.882898 -0.89373
N  1.779445 -1.366045 0.715333
C  -0.032824 -5.923513 0.092031
C  -0.652784 -5.384998 -1.233422
C  0.356339 -4.826628 1.115366
C  -3.945759 1.750542 0.118452
C  3.847091 2.184417 -0.410357
C  -3.244204 2.971054 -0.044589
C  3.506158 3.398216 0.237576
C  -1.701204 -4.304762 -0.957899
C  1.234688 -3.724395 0.511458
C  -2.049654 0.53447 -0.724826
C  2.22566 1.006679 0.920222
C  -3.386469 0.520873 -0.204976
C  3.233052 0.977562 -0.100716
C  -1.939998 3.009129 -0.542518
C  2.524459 3.452506 1.229815
C  -1.350997 1.763937 -0.884595
C  1.887442 2.229293 1.5645
C  -5.373231 3.474769 0.689544
C  5.241101 3.840159 -1.219657
C  -1.37357 -0.714656 -1.087231
C  1.526172 -0.219352 1.314395
H  -0.756649 -6.598083 0.58405
H  0.860898 -6.517484 -0.169117
H  0.157204 -5.0058 -1.881309
H  -1.151936 -6.21846 -1.757425
H  0.915706 -5.299998 1.947176
H  -0.559657 -4.387256 1.557337
H  -3.917139 -0.426132 -0.081835
H  3.490279 0.036012 -0.591405
H  -1.401191 3.951973 -0.661953
H  2.263413 4.391643 1.723042
H  -0.328079 1.751199 -1.277917
H  1.110793 2.230224 2.337626
H  -5.683423 3.794032 1.696531
H  -6.082603 3.782145 -0.101054
H  6.247548 3.88486 -0.764819
H  5.182721 4.350725 -2.193338
H  -0.278163 -2.913064 -1.638263
H  0.367758 -2.394123 1.892822
H  -0.3545 -0.62165 -1.514153
H  0.776061 -0.124885 2.126042
