program: Gaussian 09
title: 000267020
version: EM64L-G09RevD.01
frameworkgroup: C1[X(C19H18Cl2N4O2)]
method: RPBEPBE
basis: SDD
operation: Freq
keyword: #p
keyword: freq=noraman
keyword: PBEPBE/SDD
title: #p freq=noraman PBEPBE/SDD
converged: YES YES NO NO
title: Mulliken charges:
elementType: Cl Cl O O N N N N C C C C C C C C C C C C C C C C C C C H H H H H H H H H H H H H H H H H H
charge: -0.065763 -0.062082 -0.243835 -0.218014 -0.392639 -0.389152 0.038039 0.040048 -0.374579 -0.575914 -0.532942 0.283067 0.219568 0.528930 0.521194 -0.363586 -0.368554 -0.285175 -0.289683 -0.349163 -0.355156 -0.224532 -0.225640 -0.226660 -0.229186 -0.216435 -0.220547 0.225724 0.232304 0.255167 0.252386 0.236300 0.243717 0.295675 0.327408 0.233613 0.237861 0.285702 0.290794 0.258130 0.256257 0.237129 0.235576 0.238133 0.236514
chargesum: 0.00000
title: Mulliken charges with hydrogens summed into heavy atoms:
elementType: Cl Cl O O N N N N C C C C C C C C C C C C C C C C C C C
charge: -0.065763 -0.062082 -0.243835 -0.218014 -0.096964 -0.061744 0.038039 0.040048 0.083448 -0.068360 -0.052924 0.283067 0.219568 0.528930 0.521194 -0.129972 -0.130694 -0.285175 -0.289683 -0.063461 -0.064362 0.033598 0.030617 0.010468 0.006390 0.021699 0.015967
polarizability: 4.07794385e+02 -7.36948880e+01 2.25638965e+02 2.26869909e+01 3.07548929e+01 2.32409259e+02
1716.lowfreq: -4.3217 -3.4809 -2.4399 -0.0023 -0.0020 -0.0013 3.8565 8.0204 21.0634
frequency: -2.7626 7.7719 21.0556 23.4498 30.5770 50.0206 57.9418 60.2021 68.0188 111.7352 125.5945 131.0321 149.7838 163.4492 170.6237 174.4706 181.3080 197.5554 218.0858 228.2883 242.8585 258.4183 322.2570 324.6883 329.2103 334.0665 356.5193 374.6905 400.4365 441.0093 445.5661 455.1174 456.2899 483.8488 518.0403 526.4220 533.1401 556.9722 595.7014 622.8926 627.1188 646.3140 650.8610 683.6766 686.6477 692.1109 725.0835 727.2870 740.7306 766.0824 767.7250 790.6674 833.9772 839.2492 870.3561 878.6452 879.8692 945.1071 946.6942 947.9915 949.0803 963.2778 966.1194 981.4128 1002.1318 1003.0943 1010.7973 1011.5158 1022.4536 1037.3234 1038.3568 1048.9430 1075.6918 1113.4733 1122.7641 1127.7662 1139.2365 1164.3235 1170.6839 1172.0831 1186.0269 1223.3320 1227.4895 1232.9422 1262.8975 1284.8917 1286.4586 1314.3675 1327.0374 1331.4865 1351.4691 1355.8988 1380.7426 1381.4787 1425.3732 1426.6574 1443.9028 1456.7396 1459.6396 1460.3840 1470.4528 1503.7978 1516.8818 1555.1775 1557.6702 1579.2716 1582.5307 1604.9422 1606.1685 1629.0152 1644.5661 2973.6637 3009.8903 3013.5606 3022.8271 3024.4222 3027.9365 3070.1912 3091.5965 3138.6660 3141.2265 3153.0080 3155.3231 3165.9985 3168.4913 3177.4688 3179.3389 3362.9060 3373.2706
redmass: 11.7901 8.4269 8.3899 7.6028 7.5536 5.8538 7.1390 5.4776 6.6223 4.5567 7.0465 5.1746 3.7563 7.6056 5.1921 4.9078 5.7091 5.0853 2.6541 3.2982 3.4392 4.2655 4.5394 5.3053 7.9141 6.1195 6.2880 7.1557 4.5152 3.9514 6.1578 3.3548 3.4202 5.2698 5.8796 3.3014 3.4895 3.1499 5.0978 6.2814 5.9828 1.2620 2.7655 3.4143 6.7530 1.4141 3.8234 3.7491 3.8186 1.2499 1.2462 2.0265 4.8373 4.5365 3.1643 1.3474 1.3465 1.9082 2.3863 2.3889 1.7659 1.3900 1.3933 3.1647 1.3490 1.3521 6.7593 6.5355 2.8854 2.0116 2.0118 3.2618 3.1444 2.4358 1.7128 1.9507 1.9570 1.9289 1.0620 1.0625 1.4334 1.6334 1.6510 1.6495 1.2724 1.6696 1.6536 1.3600 1.6482 1.7286 1.3916 1.5077 4.2876 4.6090 2.4436 2.4315 1.1042 1.2004 2.2401 2.0809 1.1676 1.8831 1.7475 5.8744 6.1901 5.5228 5.9754 6.8067 6.8894 6.4585 6.0400 1.0596 1.0637 1.0880 1.0880 1.0681 1.0877 1.1029 1.1041 1.0860 1.0861 1.0905 1.0906 1.0958 1.0957 1.0996 1.0998 1.0768 1.0756
irintensity: 0.1594 0.0931 0.1259 2.2571 1.1390 4.3055 6.4399 0.1285 13.3806 20.3282 6.5740 2.8274 5.6666 0.3649 4.1876 0.2407 7.1362 5.1179 8.0749 19.1186 15.5426 6.0062 0.8657 1.2079 0.6636 0.7337 5.6312 6.3053 6.8710 5.2781 2.1565 10.8660 9.0276 2.1719 1.3308 0.3845 0.2312 7.6812 6.5831 6.9430 11.9352 84.6657 12.5848 72.1462 26.8211 104.1419 6.7647 11.7088 6.2228 73.6852 66.7250 26.4191 1.3342 3.2176 11.4461 0.0725 0.4460 27.2993 30.2970 1.9342 18.9123 12.0119 9.1197 6.6648 2.1259 1.4105 34.7104 61.4218 13.8306 11.0858 12.3701 8.2291 4.6736 16.5250 28.9347 4.3517 412.2566 106.8054 1.9869 3.5857 28.3937 26.1715 22.4386 226.4793 3.3551 10.2650 14.4810 33.4643 33.1120 19.5805 3.0420 24.6840 0.3878 1.8006 33.7367 40.4481 23.1861 13.0608 27.8138 48.2888 77.7987 109.4241 309.4304 1.3400 3.1848 15.8850 14.7877 7.0129 12.8087 235.1347 177.6911 17.4227 24.9303 30.0788 29.9514 15.7732 33.3956 16.0074 22.0625 2.0593 1.5702 6.4347 6.4798 7.4519 5.5773 16.1133 14.5889 10.6929 7.5155
temp: 298.150 k
press: 1.00000 atm
elementType: 17 17 8 8 7 7 7 7 6 6 6 6 6 6 6 6 6 6 6 6 6 6 6 6 6 6 6 1 1 1 1 1 1 1 1 1 1 1 1 1 1 1 1 1 1
symmnumber: 1
zpe: 884251.5 jmol-1
zpe.correction: 0.336794 hartree
zpe.thermalcorrener: 0.361798 hartree
zpe.thermalcorrenthalpy: 0.362742 hartree
zpe.thermalcorrgfe: 0.277770 hartree
zpe.sumelectzpe: -2022.417507 hartree
zpe.sumelectthermal: -2022.392503 hartree
zpe.sumelectthermalent: -2022.391559 hartree
zpe.sumelectthermalfe: -2022.476531 hartree
dipole: -3.0661 -1.2030 0.6465
dipole: 3.3565
quadrupole: -166.5737 -162.1641 -167.8950
quadrupole: -17.0016 2.0814 -3.6699
quadrupole: -1.0294 3.3802 -2.3507 -17.0016 2.0814 -3.6699
hfenergy: -2022.7543011 hartree
pointgroup: C01 [X(C19H18Cl2N4O2)]
dipole: -0.9480959 0.7926605 0.4654944 debye
polarizability: 225.6957174|-45.1767678|424.6913731|39.609153|5.6663664|215.4555192 unknown
InChI: InChI=1S/C19H18Cl2N4O2/c20-16-8-3-1-6-14(16)12-22-24-18(26)10-5-11-19(27)25-23-13-15-7-2-4-9-17(15)21/h1-4,6-9,12-13,24-25H,5,10-11H2
charge 0 multiplicity 1
45 atoms
Cl -2.881726 2.384737 3.256167
Cl 0.481114 2.575369 -1.989454
O  -1.331645 -3.210934 -1.069622
O  3.123516 -3.77107 0.3523
N  -1.400884 -2.008182 0.940319
N  1.762267 -2.339284 -0.92979
N  -2.011585 -0.904722 0.372131
N  2.392626 -1.182354 -0.51895
C  0.330477 -5.299004 0.09945
C  -0.365621 -4.228028 0.971767
C  1.299712 -4.741712 -0.987308
C  -1.07757 -3.134697 0.163961
C  2.173468 -3.603976 -0.456068
C  -2.915892 1.318551 0.632629
C  2.518538 1.226553 -0.557914
C  -2.285081 0.10754 1.169952
C  1.889279 -0.041407 -0.948039
C  -3.240106 2.42943 1.455988
C  1.997534 2.485928 -0.95763
C  -3.227058 1.428044 -0.756455
C  3.697973 1.241388 0.247749
C  -3.839397 3.597504 0.951276
C  2.594854 3.705906 -0.59105
C  -3.826677 2.58577 -1.280057
C  4.310062 2.449073 0.624476
C  -4.134429 3.675334 -0.427895
C  3.76098 3.686802 0.205797
H  0.89297 -5.963362 0.780416
H  -0.431772 -5.913012 -0.412865
H  0.379059 -3.757472 1.644968
H  -1.10928 -4.727787 1.625161
H  1.974504 -5.554531 -1.308206
H  0.710269 -4.415642 -1.860754
H  -1.143929 -2.008376 1.94041
H  0.929749 -2.298232 -1.541309
H  -2.055903 0.09718 2.251871
H  0.997159 0.014188 -1.598376
H  -2.980442 0.574364 -1.395271
H  4.104746 0.273062 0.55637
H  -4.070164 4.428411 1.623576
H  2.155608 4.650936 -0.922533
H  -4.054036 2.645794 -2.349275
H  5.214375 2.431866 1.241603
H  -4.600059 4.581451 -0.829158
H  4.232915 4.631801 0.49434
