program: Gaussian 09
title: 000267019
version: EM64L-G09RevD.01
frameworkgroup: C1[X(C19H16Cl4N4O2)]
method: RPBEPBE
basis: SDD
operation: Freq
keyword: #p
keyword: freq=noraman
keyword: PBEPBE/SDD
title: #p freq=noraman PBEPBE/SDD
converged: YES YES NO NO
title: Mulliken charges:
elementType: Cl Cl Cl Cl O O N N N N C C C C C C C C C C C C C C C C C C C H H H H H H H H H H H H H H H H
charge: -0.047184 -0.045762 -0.031869 -0.037473 -0.239843 -0.215507 -0.394227 -0.389592 0.036056 0.041143 -0.374979 -0.571922 -0.533581 0.281115 0.223190 0.566613 0.555796 -0.368500 -0.372958 -0.284471 -0.288127 -0.346754 -0.348826 -0.213539 -0.215967 -0.216201 -0.218495 -0.091313 -0.091895 0.228039 0.234459 0.251235 0.254426 0.238214 0.243407 0.297099 0.327267 0.237350 0.240407 0.291889 0.296664 0.284452 0.283465 0.263891 0.262807
chargesum: 0.00000
title: Mulliken charges with hydrogens summed into heavy atoms:
elementType: Cl Cl Cl Cl O O N N N N C C C C C C C C C C C C C C C C C C C
charge: -0.047184 -0.045762 -0.031869 -0.037473 -0.239843 -0.215507 -0.097127 -0.062325 0.036056 0.041143 0.087519 -0.066260 -0.051960 0.281115 0.223190 0.566613 0.555796 -0.131150 -0.132551 -0.284471 -0.288127 -0.054865 -0.052162 0.070914 0.067498 0.047690 0.044312 -0.091313 -0.091895
polarizability: 4.82634940e+02 -6.26836350e+01 2.50713634e+02 2.28641257e+01 5.18951789e+01 2.27974967e+02
1716.lowfreq: -7.9097 -4.6570 -0.0028 -0.0025 -0.0022 2.1301 4.3941 7.1217 18.7492
frequency: -4.9701 6.9697 18.7302 22.7702 24.4654 46.3301 48.8858 50.8415 56.4072 89.2868 110.1333 122.2319 137.6688 161.5030 162.3900 163.0170 166.8176 170.8062 185.4482 190.4876 192.1105 215.6763 219.1443 240.3074 253.4494 272.7719 329.8406 337.5037 358.2269 366.9646 372.4203 372.8039 377.3821 400.0277 431.1629 453.7354 455.8267 459.0214 462.5096 524.2021 543.9725 553.4814 556.5646 568.0905 612.0591 631.4313 648.5816 649.3631 651.6371 687.1620 714.8202 717.0984 722.5142 728.1981 747.5961 790.7567 836.0104 840.6056 840.7229 842.5094 865.3491 866.3368 869.8699 942.4933 944.9024 946.5648 947.7052 980.1111 986.9443 988.9576 1017.0568 1020.6199 1024.2516 1051.1521 1076.5195 1082.0339 1082.9278 1118.1933 1133.9415 1139.6321 1141.6379 1160.4973 1186.5316 1222.1872 1225.9031 1230.7081 1260.6393 1273.2722 1273.9797 1312.9460 1325.5600 1330.3733 1351.0039 1353.3766 1361.4349 1362.3112 1392.7084 1393.7482 1439.5687 1454.8489 1455.9000 1457.5386 1470.5004 1499.3940 1509.0523 1547.1237 1549.1206 1577.0221 1580.1013 1592.9376 1594.4887 1629.4871 1645.0446 2975.0096 3012.0954 3017.7077 3023.8815 3027.4336 3029.4470 3071.9772 3090.9332 3157.8305 3159.2550 3180.0796 3180.2546 3185.7791 3185.8556 3361.8875 3375.2601
redmass: 14.0538 13.3163 14.4176 9.7108 11.0895 7.4466 7.4200 7.9061 9.3339 6.0689 6.4455 8.3701 3.8108 5.5806 6.5884 7.4264 10.9899 7.2967 4.0343 4.6541 4.1930 3.5042 8.3335 4.6951 4.9210 4.2385 7.1497 7.2998 4.9092 4.6205 12.5879 12.4575 5.0664 4.1903 4.8790 4.7764 5.6193 3.4919 3.8746 5.0129 3.8844 4.1797 4.2037 4.7641 5.2778 1.2282 6.9620 6.9195 3.0070 1.1817 3.9446 3.9234 5.7553 7.4948 4.5766 2.0396 4.9188 4.7939 1.3663 1.3665 1.4028 1.4000 3.1882 1.5607 3.0409 1.9501 2.3245 3.1664 1.3621 1.3624 3.2432 3.9661 3.1162 3.1933 2.5943 2.4999 2.8250 3.3124 1.8661 1.4196 1.5242 2.0077 1.4293 1.6381 1.6393 1.6138 1.2730 1.5351 1.5643 1.3607 1.8181 2.0170 1.4100 1.5620 2.5579 2.6779 5.1856 5.3458 1.1012 1.8297 2.1551 1.3880 1.1547 1.9017 1.7845 8.1304 8.4594 5.6294 6.1002 7.0748 7.1774 6.5141 6.2115 1.0595 1.0635 1.0881 1.0639 1.0881 1.0923 1.1028 1.1041 1.0893 1.0891 1.0966 1.0969 1.0939 1.0940 1.0769 1.0757
irintensity: 0.5004 0.1639 0.1451 1.1016 1.5088 2.8330 0.6204 3.3816 14.8020 16.4033 0.7724 10.7301 7.6514 0.2318 0.1676 0.1044 1.6011 2.3009 9.1891 10.3872 1.9925 13.4890 1.1774 15.7227 13.6099 7.8196 4.2654 6.1973 1.6603 2.4982 6.6869 4.6012 2.7444 11.9744 5.5667 4.8581 1.7935 7.4672 7.5710 2.1669 0.6579 7.6870 8.7332 16.0118 27.6667 95.3060 0.8785 0.5760 8.7071 153.9730 0.2836 4.5669 8.3158 62.7277 27.8063 26.1186 25.4270 24.2001 30.0086 30.7683 31.7565 4.9897 2.6478 51.6353 4.4822 20.9682 10.8700 3.0655 4.4749 3.7283 12.4573 81.6912 30.7136 8.1822 22.0455 14.8426 78.7643 9.8899 256.2019 6.0952 217.4280 115.8895 26.1579 25.9222 27.9625 251.9575 3.2944 5.9071 20.8637 31.5146 35.3841 23.7653 4.2291 20.7953 5.4301 9.9601 21.5516 23.7362 22.0495 104.1016 73.0029 98.1252 68.5969 59.7282 302.5703 17.1761 19.7694 23.1064 17.7616 77.6507 104.5154 228.7896 177.7881 16.6427 24.7913 30.7450 15.1227 31.7161 31.7561 14.8325 22.5358 0.2303 0.1018 1.7721 1.0917 0.5622 0.6436 9.0065 6.0575
temp: 298.150 k
press: 1.00000 atm
elementType: 17 17 17 17 8 8 7 7 7 7 6 6 6 6 6 6 6 6 6 6 6 6 6 6 6 6 6 6 6 1 1 1 1 1 1 1 1 1 1 1 1 1 1 1 1
symmnumber: 1
zpe: 832568.9 jmol-1
zpe.correction: 0.317109 hartree
zpe.thermalcorrener: 0.344811 hartree
zpe.thermalcorrenthalpy: 0.345755 hartree
zpe.thermalcorrgfe: 0.254024 hartree
zpe.sumelectzpe: -2941.194677 hartree
zpe.sumelectthermal: -2941.166975 hartree
zpe.sumelectthermalent: -2941.166031 hartree
zpe.sumelectthermalfe: -2941.257762 hartree
dipole: 0.6249 -2.8410 1.2716
dipole: 3.1748
quadrupole: -202.9812 -204.1324 -189.8564
quadrupole: -13.4570 1.6148 -7.6637
quadrupole: -3.9912 -5.1424 9.1336 -13.4570 1.6148 -7.6637
hfenergy: -2941.5117859 hartree
pointgroup: C01 [X(C19H16Cl4N4O2)]
dipole: -0.8957432 -0.6435872 0.5861378 debye
polarizability: 249.2962262|-36.5176948|492.9886298|55.6832666|-3.4604714|219.038685 unknown
InChI: InChI=1S/C19H16Cl4N4O2/c20-14-6-4-12(16(22)8-14)10-24-26-18(28)2-1-3-19(29)27-25-11-13-5-7-15(21)9-17(13)23/h4-11,26-27H,1-3H2
charge 0 multiplicity 1
45 atoms
Cl -2.372826 2.29942 3.217369
Cl 0.334302 2.21217 -2.047472
Cl -4.742035 4.867972 -1.067285
Cl 4.543135 4.875364 0.357754
O  -1.475594 -3.594152 -0.898923
O  3.026974 -4.088574 0.361846
N  -1.348206 -2.311987 1.058461
N  1.632511 -2.700203 -0.930919
N  -1.957154 -1.209865 0.489437
N  2.275987 -1.534276 -0.575363
C  0.258407 -5.65658 0.226554
C  -0.412576 -4.576854 1.109313
C  1.177991 -5.106693 -0.905981
C  -1.130999 -3.483501 0.309305
C  2.058312 -3.9508 -0.428808
C  -2.751515 1.056404 0.704192
C  2.418893 0.867623 -0.687091
C  -2.121102 -0.148431 1.253025
C  1.762982 -0.402637 -1.017685
C  -2.929655 2.235907 1.475319
C  1.893077 2.12365 -1.091441
C  -3.214901 1.089677 -0.645458
C  3.63505 0.888984 0.061297
C  -3.528103 3.400052 0.959179
C  2.517906 3.347358 -0.786166
C  -3.818025 2.233582 -1.192866
C  4.285599 2.091252 0.384517
C  -3.965333 3.377556 -0.378416
C  3.714902 3.308443 -0.047137
H  0.852717 -6.305565 0.894857
H  -0.517709 -6.284272 -0.246429
H  0.347981 -4.111435 1.767759
H  -1.149393 -5.068245 1.776405
H  1.848748 -5.917512 -1.240251
H  0.551487 -4.802841 -1.761674
H  -1.016337 -2.282751 2.035664
H  0.783433 -2.677072 -1.519924
H  -1.797858 -0.112489 2.309684
H  0.848123 -0.357509 -1.63591
H  -3.085144 0.184138 -1.245706
H  4.048867 -0.074485 0.374796
H  -3.647902 4.291175 1.579254
H  2.084922 4.295049 -1.113883
H  -4.167175 2.242464 -2.228755
H  5.217038 2.08829 0.956758
