program: Gaussian 09
title: 000267018
version: EM64L-G09RevD.01
frameworkgroup: C1[X(C23H24N4O2)]
method: RPBEPBE
basis: SDD
operation: Freq
keyword: #p
keyword: freq=noraman
keyword: PBEPBE/SDD
title: #p freq=noraman PBEPBE/SDD
converged: YES YES NO NO
title: Mulliken charges:
elementType: O O N N N N C C C C C C C C C C C C C C C C C C C C C C C H H H H H H H H H H H H H H H H H H H H H H H H
charge: -0.213738 -0.222699 -0.379053 -0.392704 0.039480 0.037059 -0.377512 -0.539161 -0.552636 0.223082 0.254388 0.471615 0.473396 -0.295436 -0.298861 -0.388481 -0.384307 -0.380888 -0.385117 -0.292531 -0.281534 -0.221812 -0.217444 -0.232899 -0.232511 -0.243663 -0.244920 -0.243902 -0.238798 0.237917 0.230891 0.237221 0.238729 0.250178 0.239856 0.315188 0.294918 0.222574 0.223490 0.231181 0.230674 0.241452 0.236801 0.221448 0.216496 0.251705 0.253641 0.229282 0.230508 0.230552 0.231386 0.231954 0.233543
chargesum: 0.00000
title: Mulliken charges with hydrogens summed into heavy atoms:
elementType: O O N N N N C C C C C C C C C C C C C C C C C C C C C C C
charge: -0.213738 -0.222699 -0.063865 -0.097786 0.039480 0.037059 0.091296 -0.063211 -0.062601 0.223082 0.254388 0.471615 0.473396 -0.072862 -0.075371 -0.157299 -0.153633 -0.139436 -0.148316 -0.071083 -0.065037 0.029893 0.036197 -0.003617 -0.002004 -0.013111 -0.013534 -0.011948 -0.005256
polarizability: 6.82595431e+02 -2.74275444e+01 2.58525003e+02 4.42366016e+00 5.83813782e+01 1.71995250e+02
1716.lowfreq: -7.5128 -4.6618 -4.3624 0.0003 0.0006 0.0006 12.7347 15.3501 21.5692
frequency: 12.5372 14.8259 21.5201 23.1027 38.4795 43.5009 44.3750 46.3156 60.6240 88.9155 102.9000 104.1315 110.8193 136.0832 155.1312 166.4704 184.3027 194.5121 200.7566 205.8709 210.7647 246.7150 276.3644 292.8385 310.9596 316.4093 353.3772 367.3612 384.3548 402.9242 404.3284 412.9010 427.0020 427.7963 445.0188 511.9424 514.2961 549.1206 554.8288 588.5093 602.5922 609.4772 615.5622 615.8636 620.8440 630.3423 658.3667 674.6019 694.0168 696.0452 739.5360 767.6743 768.2399 792.0392 833.4316 837.5881 844.7602 849.2989 862.6644 878.0756 879.8756 924.5579 925.2213 927.2103 931.1322 940.1763 942.5099 969.0989 979.2165 980.5904 987.1176 987.3843 990.5988 993.3134 1001.4344 1005.5133 1009.9414 1025.2713 1026.1754 1042.4192 1069.7725 1082.5264 1083.8136 1104.1752 1126.4777 1138.9662 1172.4856 1173.4775 1183.7047 1191.0103 1191.7945 1192.9183 1202.0914 1222.0150 1236.7952 1237.4108 1259.8293 1262.5985 1263.6617 1294.8041 1296.8640 1310.0881 1321.1799 1323.6735 1345.9012 1348.1012 1350.9910 1354.7869 1387.0223 1387.2927 1439.5972 1440.1384 1444.5650 1453.6091 1471.7274 1482.3787 1482.8253 1488.8925 1499.5380 1552.9779 1553.5503 1580.4162 1580.9290 1608.4991 1608.7059 1630.4870 1632.8535 1636.2404 1643.2296 2972.2665 2976.8077 2979.4293 3012.8955 3016.8168 3034.4293 3074.9012 3082.2097 3085.6488 3087.8076 3119.6541 3121.4715 3127.4851 3128.4564 3135.2786 3136.2866 3140.1477 3140.9935 3149.9990 3150.9514 3165.6549 3167.0663 3367.3149 3374.0856
redmass: 6.5027 5.6604 4.5324 5.7494 5.3340 4.9317 4.9884 5.0760 5.8436 5.7731 5.2331 4.9062 4.4789 3.9650 2.9226 3.6826 2.5132 3.8737 3.4321 5.9510 6.1025 3.3558 3.6479 4.3799 2.8572 2.9832 3.9936 3.6560 3.8822 2.7888 2.8136 3.6607 4.9923 5.2653 4.0037 2.8901 2.9479 3.6437 4.1534 4.4357 4.3038 4.7107 5.8684 5.9527 2.0349 2.0774 2.3464 1.2784 1.7246 1.7407 4.1974 1.7137 1.7036 2.0172 4.6040 4.3809 1.2906 1.3011 3.2753 1.6361 1.6188 3.0721 1.7848 1.5446 1.5120 1.5181 3.1287 2.8936 1.3934 1.3912 5.8002 5.6252 1.2228 1.2734 1.2496 1.2051 2.9095 2.1844 2.1831 2.6428 3.4802 1.6766 1.6943 3.4936 1.8975 2.0515 1.0783 1.0832 1.5589 1.9281 1.1350 1.1276 1.7606 1.6418 1.6330 1.6138 1.3008 1.6494 1.7538 1.6292 1.6361 1.3699 1.4713 1.4276 1.3438 1.3622 1.4550 1.4661 5.7088 5.8743 2.3103 2.2822 1.0967 1.0903 1.1851 2.2421 2.1965 1.8135 1.6692 5.3162 5.2023 5.4028 5.4310 5.9192 5.8959 6.3045 5.3309 5.2888 6.2355 1.0878 1.0877 1.0596 1.0600 1.0642 1.0978 1.1014 1.0897 1.0896 1.1044 1.0872 1.0861 1.0868 1.0865 1.0901 1.0901 1.0916 1.0913 1.0958 1.0959 1.1014 1.1014 1.0762 1.0758
irintensity: 3.3060 0.9221 1.4669 0.8933 4.9719 0.9821 1.3514 2.4447 0.4753 19.9761 2.9640 2.4388 7.6060 6.9843 2.6626 8.7203 8.9741 5.2037 1.3105 1.9711 0.7674 9.4997 0.9221 2.3610 5.9514 4.9112 0.9195 3.5857 3.9184 0.1148 0.0895 4.0100 1.4294 1.4161 0.1033 20.6620 5.0856 3.1547 2.1913 12.3837 3.6719 9.9488 2.4354 3.0104 95.0265 60.9881 14.5799 44.1391 83.3924 14.0832 14.0768 128.1367 2.1551 18.4471 0.1985 1.4475 1.0818 0.9585 10.8040 0.3869 1.0257 2.1966 4.5163 0.5804 1.6088 0.1055 14.5611 1.2272 0.2109 0.6185 0.1696 1.8120 112.5531 2.8389 76.2738 3.7463 2.2229 4.7328 4.6406 10.0842 44.3783 14.8070 1.5264 0.2632 523.7612 159.8716 1.6976 2.1337 3.6180 4.4960 0.3707 2.7499 52.7376 302.0114 1.0711 22.9326 13.4579 7.9963 16.6751 2.1144 2.2734 21.7051 7.1083 8.7519 1.0293 1.0772 3.2916 32.0428 1.0711 0.2424 12.7425 15.4745 14.7826 24.0278 130.6386 10.6344 5.5178 68.7860 433.7750 1.0997 6.2642 5.8585 8.2811 0.1924 0.9685 260.4092 109.4528 65.8766 256.0436 49.8352 42.5240 14.7778 22.5284 23.5134 31.4573 22.2505 24.7415 13.8816 26.4895 10.6434 7.5508 1.2736 3.2838 17.0971 16.2716 9.6718 1.9971 37.3769 26.4041 29.7599 35.8412 0.9328 3.4116
temp: 298.150 k
press: 1.00000 atm
elementType: 8 8 7 7 7 7 6 6 6 6 6 6 6 6 6 6 6 6 6 6 6 6 6 6 6 6 6 6 6 1 1 1 1 1 1 1 1 1 1 1 1 1 1 1 1 1 1 1 1 1 1 1 1
symmnumber: 1
zpe: 1107193.0 jmol-1
zpe.correction: 0.421708 hartree
zpe.thermalcorrener: 0.449448 hartree
zpe.thermalcorrenthalpy: 0.450392 hartree
zpe.thermalcorrgfe: 0.358330 hartree
zpe.sumelectzpe: -1258.161356 hartree
zpe.sumelectthermal: -1258.133616 hartree
zpe.sumelectthermalent: -1258.132672 hartree
zpe.sumelectthermalfe: -1258.224733 hartree
dipole: -5.3453 -1.0777 1.6011
dipole: 5.6831
quadrupole: -159.3981 -185.2528 -164.4111
quadrupole: -10.5840 4.1607 5.2865
quadrupole: 10.2893 -15.5655 5.2762 -10.5840 4.1607 5.2865
hfenergy: -1258.5830637 hartree
pointgroup: C01 [X(C23H24N4O2)]
dipole: -2.0055438 -0.695785 0.7020932 debye
polarizability: 681.391916|32.8277245|261.413137|-18.9626681|55.6890818|170.3106306 unknown
InChI: InChI=1S/C23H24N4O2/c28-22(26-24-18-8-14-20-10-3-1-4-11-20)16-7-17-23(29)27-25-19-9-15-21-12-5-2-6-13-21/h1-6,8-15,18-19,26-27H,7,16-17H2
charge 0 multiplicity 1
53 atoms
O  5.222492 2.942608 -0.218723
O  4.545308 -2.031952 -0.558449
N  3.64173 1.468677 -1.152521
N  2.965335 -1.072735 0.889419
N  2.536064 2.19121 -0.737935
N  1.898339 -1.793578 0.376789
C  6.465778 0.067418 0.170204
C  5.993769 0.789801 -1.128075
C  5.316254 -0.384905 1.10608
C  4.95246 1.863629 -0.806165
C  4.271664 -1.25027 0.390835
C  -2.384861 2.324731 -0.266162
C  -2.985871 -2.557786 0.336907
C  -1.103289 1.757393 -0.701891
C  -1.745531 -1.898063 0.761861
C  -2.505497 3.609095 0.345029
C  -3.013126 -3.671023 -0.555949
C  -3.571931 1.555977 -0.45262
C  -4.228554 -2.067591 0.837471
C  1.352204 1.648606 -0.989593
C  0.695472 -1.485467 0.841466
C  0.145946 2.314267 -0.54807
C  -0.465369 -2.2003 0.35703
C  -3.761797 4.097504 0.751833
C  -4.233998 -4.264674 -0.928971
C  -4.829575 2.046178 -0.04444
C  -5.450474 -2.664556 0.465122
C  -4.931618 3.320336 0.560983
C  -5.459856 -3.766438 -0.421521
H  7.062976 -0.812368 -0.127673
H  7.121439 0.747076 0.7439
H  5.601542 0.039342 -1.838103
H  6.862393 1.283828 -1.596787
H  5.748234 -0.984547 1.932049
H  4.8394 0.49969 1.571833
H  3.521051 0.564386 -1.637115
H  2.812291 -0.356455 1.617032
H  -1.165812 0.772484 -1.190262
H  -1.871968 -1.071527 1.478528
H  -1.615115 4.229186 0.496429
H  -2.076535 -4.076707 -0.953881
H  -3.49999 0.566845 -0.922078
H  -4.226288 -1.211389 1.523914
H  1.240179 0.677544 -1.515052
H  0.531781 -0.684058 1.591891
H  0.290226 3.285509 -0.059636
H  -0.260782 -3.002296 -0.362486
H  -3.835375 5.087306 1.216268
H  -4.235427 -5.120045 -1.613747
H  -5.727258 1.437787 -0.202012
H  -6.39258 -2.274562 0.866031
H  -5.906965 3.706335 0.877038
H  -6.406889 -4.233754 -0.712626
