program: Gaussian 09
title: 000267015
version: EM64L-G09RevD.01
frameworkgroup: C1[X(C21H24N4O2)]
method: RPBEPBE
basis: SDD
operation: Freq
keyword: #p
keyword: freq=noraman
keyword: PBEPBE/SDD
title: #p freq=noraman PBEPBE/SDD
converged: YES YES NO NO
title: Mulliken charges:
elementType: O O N N N N C C C C C C C C C C C C C C C C C C C C C H H H H H H H H H H H H H H H H H H H H H H H H
charge: -0.227475 -0.284008 -0.382221 -0.368991 0.030751 0.042187 -0.385704 -0.513204 -0.548332 0.199844 0.285183 0.300304 0.272838 0.319236 0.329128 -0.369360 -0.322625 -0.395988 -0.373649 -0.426472 -0.410161 -0.834927 -0.828726 -0.237625 -0.224952 -0.232596 -0.234282 0.239870 0.227355 0.226719 0.238607 0.250515 0.207756 0.345039 0.288389 0.285116 0.270377 0.230724 0.230690 0.232398 0.211676 0.242625 0.228693 0.233915 0.227794 0.233650 0.237214 0.228338 0.248456 0.226082 0.229827
chargesum: 0.00000
title: Mulliken charges with hydrogens summed into heavy atoms:
elementType: O O N N N N C C C C C C C C C C C C C C C C C C C C C
charge: -0.227475 -0.284008 -0.037182 -0.080603 0.030751 0.042187 0.081521 -0.047877 -0.090061 0.199844 0.285183 0.300304 0.272838 0.319236 0.329128 -0.084244 -0.052248 -0.163589 -0.161973 -0.195748 -0.179471 -0.129693 -0.130068 -0.009287 0.023504 -0.006514 -0.004454
polarizability: 4.37934615e+02 -1.14933257e+01 2.39606913e+02 -1.22962421e+00 -1.35359629e+01 2.04811241e+02
1716.lowfreq: -2.6203 -0.0006 0.0003 0.0007 4.3836 4.7911 15.4295 23.5727 27.5084
frequency: 15.3174 23.5577 27.4938 30.2523 37.6602 49.8767 64.8834 67.1774 89.9735 99.4848 137.6515 154.6600 162.6304 166.6158 172.4170 183.7897 186.5263 200.7280 212.3149 219.7641 236.2391 244.1338 264.7570 271.7139 325.8835 342.4032 367.7308 369.2152 387.6052 411.8714 421.0605 458.8789 459.0878 481.3287 486.5381 522.7120 530.8001 534.7361 536.9351 584.2695 604.5280 625.7230 628.8914 637.7395 683.0217 723.9654 728.7737 729.2434 745.6689 770.1786 772.7382 781.7073 783.0949 820.2701 839.7087 856.1627 864.7743 884.7090 885.7257 926.4729 937.6511 944.0954 953.8480 966.2317 966.9330 985.1166 986.0156 991.9564 1000.8381 1002.3836 1003.2643 1039.4724 1042.5543 1043.1949 1045.4497 1048.1584 1063.8521 1076.3066 1107.9400 1113.2731 1135.0290 1169.8472 1173.3431 1176.5685 1197.2538 1197.8364 1206.6824 1247.2342 1250.1404 1257.0769 1272.0404 1294.0676 1295.3125 1306.3062 1325.5955 1332.7703 1346.8019 1349.1124 1383.8870 1385.8549 1399.4171 1402.0715 1436.5737 1437.3438 1456.3360 1460.6953 1471.2078 1471.8713 1473.1226 1475.7582 1477.6801 1484.4338 1485.2644 1506.2736 1534.0582 1559.5336 1561.1910 1586.4330 1586.7460 1607.4349 1612.9569 1614.3751 1639.2565 2971.9554 2973.2326 2983.6646 2989.8536 3001.3677 3010.8299 3018.2329 3048.6541 3048.8553 3052.2716 3075.3012 3078.8074 3082.6598 3086.8194 3116.3698 3123.3579 3133.3045 3139.9543 3150.1361 3156.5997 3165.3459 3173.4300 3287.6307 3373.5163
redmass: 4.9437 4.5942 6.4796 4.9901 4.4856 5.6201 5.1303 5.0125 4.0936 4.5814 4.4603 4.2384 1.6699 1.1055 2.0075 3.4422 2.9100 4.1763 5.4831 3.6232 3.4333 3.3927 3.1473 3.0063 3.7679 4.6843 3.7419 3.7936 3.5530 3.2160 2.8684 2.8614 2.8613 4.0015 4.0284 3.8075 4.8676 3.3782 3.9080 4.5558 4.5086 1.6737 6.0228 2.6406 2.7890 4.3561 2.9164 2.5631 1.3875 1.6693 1.4422 3.3945 2.9312 3.0678 3.9764 3.0055 2.0685 1.3098 1.3047 2.7601 1.5331 1.5406 3.8693 1.4210 1.4148 1.6031 1.6372 3.4226 2.2475 1.3443 1.5076 2.7931 1.5666 1.5576 2.1169 2.0957 3.6046 3.3869 1.8068 1.9937 1.6553 1.7563 1.0730 1.0800 1.9143 2.1094 1.2741 2.1480 2.1492 2.0311 1.4339 1.5465 1.5214 1.2893 1.4094 1.6324 1.9677 1.4816 3.6964 2.9388 1.3117 1.3113 2.1874 2.1594 1.1119 1.1448 1.2950 1.9341 1.4736 1.0732 1.0480 1.3001 1.3410 1.9557 2.0133 3.9361 5.8314 5.7185 4.7283 6.4860 6.1772 6.3140 5.1083 1.0408 1.0382 1.0838 1.0616 1.0622 1.0614 1.0868 1.0971 1.0974 1.1022 1.1016 1.1000 1.0979 1.0976 1.0868 1.0868 1.0890 1.0903 1.0941 1.0953 1.0997 1.0976 1.0787 1.0757
irintensity: 3.0024 0.8368 1.2044 0.2677 0.1533 5.4026 0.9673 4.0513 6.6234 1.9983 2.9314 3.7636 28.5608 2.4440 11.1883 1.0896 0.3933 3.0773 6.1286 9.9130 9.8512 14.4563 3.5328 7.8012 1.3227 2.1324 3.1415 0.8739 5.3148 7.2073 4.7125 10.0430 6.5554 8.4218 0.6784 0.0876 0.1826 0.1297 0.0237 5.9761 4.9337 51.3303 11.2647 14.5749 17.8951 2.8723 7.8902 4.2368 260.8137 35.9115 27.7220 12.0137 14.5233 14.8377 4.2397 4.6671 1.6644 0.1845 0.2040 33.2689 26.6572 38.8126 24.1092 13.8220 2.7529 1.4283 1.0119 4.8620 1.8281 1.1727 2.9505 17.6372 7.4746 10.1089 6.8582 3.8204 53.1472 45.7163 40.6210 2.2437 151.3481 79.5102 5.3088 2.5206 6.3215 7.7075 19.1608 39.0604 12.3647 236.1596 20.8342 6.2123 15.0461 5.0715 23.5347 28.6340 16.2329 7.7044 22.4559 10.6769 10.2320 9.4520 7.6367 9.0383 37.9841 48.6608 7.7050 11.1291 17.4705 12.9157 14.5229 17.8724 32.3481 138.3860 233.4924 26.4314 27.1557 45.0336 15.3644 168.9425 7.8917 26.6956 266.1474 15.7425 22.1302 59.1666 13.5361 63.4631 13.3145 31.8902 20.1454 21.7608 25.0418 23.1204 25.5026 20.3927 21.0179 10.6145 10.5712 15.0221 12.9432 18.3685 24.4251 24.4601 8.4675 84.8507 14.5085
temp: 298.150 k
press: 1.00000 atm
elementType: 8 8 7 7 7 7 6 6 6 6 6 6 6 6 6 6 6 6 6 6 6 6 6 6 6 6 6 1 1 1 1 1 1 1 1 1 1 1 1 1 1 1 1 1 1 1 1 1 1 1 1
symmnumber: 1
zpe: 1079254.4 jmol-1
zpe.correction: 0.411066 hartree
zpe.thermalcorrener: 0.437395 hartree
zpe.thermalcorrenthalpy: 0.438340 hartree
zpe.thermalcorrgfe: 0.351821 hartree
zpe.sumelectzpe: -1182.094167 hartree
zpe.sumelectthermal: -1182.067838 hartree
zpe.sumelectthermalent: -1182.066894 hartree
zpe.sumelectthermalfe: -1182.153413 hartree
dipole: -0.0907 5.9985 1.9343
dipole: 6.3033
quadrupole: -129.3041 -144.4085 -171.5711
quadrupole: -13.3742 -6.6644 -13.6014
quadrupole: 19.1238 4.0194 -23.1432 -13.3742 -6.6644 -13.6014
hfenergy: -1182.5052332 hartree
pointgroup: C01 [X(C21H24N4O2)]
dipole: 2.4731684 -0.1029253 -0.1512445 debye
polarizability: 227.5891418|21.9998353|435.8430059|-22.4870571|-7.6812535|218.9206216 unknown
InChI: InChI=1S/C21H24N4O2/c1-16-8-3-5-10-18(16)14-22-24-20(26)12-7-13-21(27)25-23-15-19-11-6-4-9-17(19)2/h3-6,8-11,14-15,24-25H,7,12-13H2,1-2H3
charge 0 multiplicity 1
51 atoms
O  -2.323485 3.150485 -1.795764
O  0.84344 2.607015 1.414783
N  -1.721756 2.240667 0.293174
N  1.972826 1.979528 -0.541334
N  -2.287458 0.997699 0.057848
N  1.768437 0.615919 -0.35421
C  0.271221 4.815435 -0.9498
C  -1.08718 4.566445 -0.22322
C  1.534197 4.364221 -0.14717
C  -1.775474 3.260145 -0.664917
C  1.433796 2.920248 0.336896
C  -2.559288 -1.293822 0.817142
C  2.156442 -1.63944 -1.173772
C  -2.25852 -2.296594 1.796824
C  3.004714 -2.517885 -1.92421
C  -3.385753 -1.622681 -0.296614
C  1.077849 -2.175301 -0.412825
C  -2.014417 0.064966 0.952614
C  2.374042 -0.187279 -1.207692
C  -2.799424 -3.595092 1.620962
C  2.742429 -3.908657 -1.873302
C  -1.387419 -2.00743 3.010675
C  4.168856 -2.00364 -2.758516
C  -3.911415 -2.917835 -0.449579
C  0.831803 -3.559088 -0.382636
C  -3.617915 -3.913153 0.514107
C  1.671403 -4.432438 -1.114653
H  0.241263 4.321798 -1.939605
H  0.386068 5.898348 -1.142415
H  -0.947205 4.607797 0.872605
H  -1.787837 5.372704 -0.503155
H  1.636318 4.995495 0.752428
H  2.433438 4.521796 -0.77454
H  -1.069318 2.367516 1.090098
H  2.483327 2.319624 -1.371573
H  -3.596706 -0.835893 -1.02803
H  0.42734 -1.480075 0.125714
H  -2.5794 -4.365467 2.370317
H  3.387097 -4.590398 -2.440662
H  -1.361516 0.275418 1.819428
H  3.051438 0.207994 -1.990709
H  -0.366562 -1.687003 2.727199
H  -1.288197 -2.909021 3.63858
H  -1.814341 -1.207657 3.644906
H  3.829979 -1.341004 -3.578533
H  4.895595 -1.433009 -2.150425
H  4.712343 -2.843862 -3.221952
H  -4.545534 -3.154222 -1.311159
H  -0.017494 -3.949084 0.188553
H  -4.024783 -4.925055 0.406512
H  1.487638 -5.512573 -1.103393
