program: Gaussian 09
title: 000267011
version: EM64L-G09RevD.01
frameworkgroup: C1[X(C23H28N4O4)]
method: RPBEPBE
basis: SDD
operation: Freq
keyword: #p
keyword: freq=noraman
keyword: PBEPBE/SDD
title: #p freq=noraman PBEPBE/SDD
converged: YES YES NO NO
title: Mulliken charges:
elementType: O O O O N N N N C C C C C C C C C C C C C C C C C C C C C C C H H H H H H H H H H H H H H H H H H H H H H H H H H H H
charge: -0.289660 -0.289645 -0.228978 -0.227488 -0.387052 -0.384517 0.036303 0.036144 -0.384728 -0.536185 -0.532036 0.244539 0.235992 0.283978 0.277057 0.246489 0.251054 -0.375921 -0.377520 -0.367735 -0.364752 -0.367942 -0.366978 -0.257170 -0.257228 -0.234628 -0.237012 -0.240985 -0.242989 -0.691373 -0.690852 0.234659 0.236725 0.240074 0.231290 0.230484 0.236426 0.297158 0.302014 0.251998 0.253065 0.286463 0.286621 0.248146 0.247158 0.232922 0.232600 0.227504 0.226976 0.206886 0.211133 0.210080 0.210260 0.258324 0.227534 0.205015 0.258125 0.227440 0.204736
chargesum: 0.00000
title: Mulliken charges with hydrogens summed into heavy atoms:
elementType: O O O O N N N N C C C C C C C C C C C C C C C C C C C C C C C
charge: -0.289660 -0.289645 -0.228978 -0.227488 -0.089894 -0.082504 0.036303 0.036144 0.086657 -0.064820 -0.065126 0.244539 0.235992 0.283978 0.277057 0.246489 0.251054 -0.123923 -0.124455 -0.081272 -0.078131 -0.119796 -0.119820 -0.024248 -0.024628 -0.007124 -0.010035 0.177034 0.177351 -0.000500 -0.000551
polarizability: 4.84777742e+02 -6.19730735e+00 2.72829946e+02 -4.37347035e+00 -6.92447776e+01 2.22983962e+02
1716.lowfreq: -12.0307 -6.7955 -4.0767 -0.0004 0.0005 0.0008 4.6838 11.6308 22.8934
frequency: -4.7620 11.3202 22.6976 35.4077 41.4354 44.5337 45.1849 52.4003 60.9262 70.7909 77.8652 94.3800 103.5416 109.4362 117.2190 122.2948 145.8283 152.8699 154.7892 188.8490 193.4981 204.3611 216.9554 233.1592 236.1839 237.6304 239.6440 246.3903 252.3158 270.9283 324.5519 326.0940 330.6070 340.4432 379.8511 380.8347 398.8655 433.2444 454.2885 479.6772 481.3418 500.9802 508.6515 543.0668 544.7290 576.9176 583.6830 593.4936 594.6513 620.6050 639.5250 641.2251 658.4112 661.7276 733.6786 742.3084 742.7902 760.7918 761.7470 764.2415 766.2808 794.4245 823.7012 825.0847 835.6616 838.0064 863.1446 864.3365 870.4909 906.7066 907.5067 948.2856 949.9669 950.5521 952.3285 963.6367 964.7403 985.0879 992.6431 992.9548 1008.9186 1032.4279 1033.2953 1040.0260 1042.4436 1044.5599 1065.2183 1093.1457 1104.7310 1114.1327 1118.1821 1119.6410 1135.2094 1135.6249 1137.0254 1140.3277 1172.6132 1172.8708 1196.0341 1201.9297 1209.8944 1223.1816 1233.3071 1235.5872 1258.1247 1261.7463 1263.2664 1296.4194 1296.9739 1321.8963 1324.8390 1325.7690 1346.7287 1348.9367 1365.2690 1366.5200 1388.1692 1389.2078 1401.2529 1402.3554 1439.0366 1440.2316 1449.4949 1459.3680 1462.0919 1463.3771 1464.7582 1467.7891 1468.0184 1479.2018 1480.4944 1487.6684 1488.8891 1496.5395 1503.5109 1562.1964 1563.2471 1589.5082 1589.9068 1604.7986 1605.4438 1634.9620 1636.4844 2956.0330 2956.2821 2990.5636 2995.9809 2996.8531 2999.4412 3015.2039 3015.9294 3017.0709 3026.0436 3026.8013 3046.9757 3059.9261 3084.7829 3092.2439 3092.9701 3107.8357 3109.1038 3130.7259 3131.3589 3147.9522 3148.5067 3161.7626 3162.6435 3171.4581 3172.1046 3373.1528 3375.8310
redmass: 5.4119 7.0172 6.0481 6.6759 4.9685 4.6949 5.7635 4.5074 3.6404 3.1960 3.5840 2.4818 2.5411 3.3627 2.9853 4.4340 4.5462 4.6565 5.3436 3.3391 3.4532 4.1693 4.7315 3.3435 2.4327 3.0890 1.7031 1.5696 1.9283 3.5539 3.6842 3.7300 4.2058 4.1948 5.4853 5.4874 2.6049 3.4954 5.1552 3.1543 3.2053 5.0458 5.4055 3.4089 3.4960 4.0466 4.1485 5.7409 5.7627 1.4117 5.0856 4.7544 2.0826 1.3747 3.9940 3.4587 3.5654 1.4205 1.3099 3.5060 4.3471 2.0895 1.1151 1.1030 4.5257 4.7657 1.3892 1.3742 3.0536 3.4118 3.3823 3.2745 1.3969 1.4130 2.8676 1.5026 1.5049 3.4501 1.3399 1.3426 2.7045 2.7155 2.7700 2.3215 2.0974 2.3916 4.0112 2.6080 2.2751 2.7024 2.1121 2.3117 1.4364 1.4391 1.6877 1.6303 1.0782 1.0802 1.6630 2.0461 2.0117 1.7299 2.2166 2.5100 1.3220 1.1418 1.1427 1.5596 1.5597 1.4438 1.6689 1.6540 1.3772 1.3938 1.3287 1.3298 4.8539 4.7244 1.2945 1.2890 2.3619 2.4089 1.0811 1.1167 1.0408 1.0409 1.1542 1.4586 1.5276 1.2680 1.2637 1.2096 1.2047 1.9079 1.8672 6.2013 6.2595 6.0753 6.0044 6.3359 6.3499 6.8545 6.6383 1.0551 1.0551 1.0596 1.0364 1.0364 1.0596 1.1075 1.1075 1.0625 1.0881 1.0879 1.1003 1.1008 1.1045 1.0986 1.0986 1.1018 1.1017 1.0859 1.0859 1.0898 1.0899 1.0939 1.0939 1.0997 1.0995 1.0762 1.0759
irintensity: 0.5833 4.8516 0.1959 0.1122 3.5092 1.4252 3.3547 0.3281 0.0266 2.1275 0.1608 33.3716 0.0996 0.1672 7.3577 0.1754 5.2759 6.0731 5.4337 31.7792 1.4090 2.1025 4.3422 11.6896 5.2931 1.0856 1.0053 1.2588 1.9797 1.4616 0.8822 2.8845 0.2917 0.7114 1.5883 0.8313 6.1814 2.8955 0.6407 5.8763 6.2853 1.4013 4.6903 2.4426 0.7430 17.5871 21.6706 10.9609 5.2855 143.0103 13.7942 11.9266 2.6956 8.3769 9.7477 0.0731 0.1541 175.7781 13.7572 26.6154 1.8616 20.4933 3.2536 0.8738 0.4675 3.2044 0.2450 0.0264 3.7908 46.0701 22.4613 0.8606 0.2364 0.2722 11.6993 55.6110 10.6774 12.9587 4.9811 0.2239 0.8636 41.9890 46.4191 29.3212 7.5896 5.0737 77.0101 32.1645 38.2908 2.7571 39.7026 10.7377 4.9348 6.7013 185.0092 182.6603 12.4012 15.9975 23.6829 19.3465 52.2910 151.9666 203.0329 211.0974 19.9703 0.0510 0.2601 5.2394 14.1075 31.5658 16.4880 30.4970 20.1184 4.6478 4.1918 6.3836 3.3887 77.6862 30.3935 27.4358 21.8512 86.1724 6.3544 45.4856 12.0661 11.7156 68.1960 33.3543 47.4636 7.1218 13.4195 2.4309 1.3028 17.1972 357.4707 0.0568 0.5171 24.3718 40.2374 1.1669 81.8537 286.4138 189.0026 28.7945 58.6377 16.9025 21.5433 19.0546 13.3434 69.9045 18.7414 30.1004 36.6799 22.0822 20.9101 30.7397 21.0461 21.8446 23.8851 26.3719 24.6649 2.0452 2.0387 12.0391 10.8147 14.0825 13.3309 19.5515 20.7190 2.9323 8.1747
temp: 298.150 k
press: 1.00000 atm
elementType: 8 8 8 8 7 7 7 7 6 6 6 6 6 6 6 6 6 6 6 6 6 6 6 6 6 6 6 6 6 6 6 1 1 1 1 1 1 1 1 1 1 1 1 1 1 1 1 1 1 1 1 1 1 1 1 1 1 1 1
symmnumber: 1
zpe: 1245622.1 jmol-1
zpe.correction: 0.474432 hartree
zpe.thermalcorrener: 0.505112 hartree
zpe.thermalcorrenthalpy: 0.506056 hartree
zpe.thermalcorrgfe: 0.410161 hartree
zpe.sumelectzpe: -1410.804925 hartree
zpe.sumelectthermal: -1410.774245 hartree
zpe.sumelectthermalent: -1410.773301 hartree
zpe.sumelectthermalfe: -1410.869196 hartree
dipole: -7.5757 -0.1005 -0.2942
dipole: 7.5821
quadrupole: -161.0320 -204.2766 -169.4498
quadrupole: -3.6071 -0.7293 -2.0292
quadrupole: 17.2208 -26.0238 8.8030 -3.6071 -0.7293 -2.0292
hfenergy: -1411.279357 hartree
pointgroup: C01 [X(C23H28N4O4)]
dipole: -2.9776577 -0.1173993 0.1350599 debye
polarizability: 483.3431782|19.4148554|254.7717649|5.6393114|-73.2479414|242.4767073 unknown
InChI: InChI=1S/C23H28N4O4/c1-3-30-20-12-7-5-10-18(20)16-24-26-22(28)14-9-15-23(29)27-25-17-19-11-6-8-13-21(19)31-4-2/h5-8,10-13,16-17,26-27H,3-4,9,14-15H2,1-2H3
charge 0 multiplicity 1
59 atoms
O  -2.215279 0.88477 1.730351
O  -1.842588 -1.260011 -1.709322
O  3.92255 2.77399 -0.756432
O  4.592716 -2.089067 0.617746
N  2.44417 1.725864 0.740586
N  2.911558 -1.214389 -0.774113
N  1.294734 2.246827 0.165101
N  1.886559 -1.956023 -0.207362
C  5.85762 0.627347 0.042426
C  4.851318 1.319444 0.998871
C  5.189731 -0.324931 -0.98838
C  3.722389 2.024274 0.236411
C  4.234594 -1.309358 -0.30468
C  -1.126343 2.320123 0.148009
C  -0.480475 -2.460579 -0.142505
C  -2.35128 1.821971 0.69836
C  -1.784602 -2.204209 -0.676517
C  0.149968 1.833091 0.676178
C  0.673957 -1.73636 -0.680864
C  -1.191693 3.280816 -0.896741
C  -0.349706 -3.41717 0.900063
C  -3.598193 2.276753 0.20377
C  -2.916278 -2.887696 -0.168043
C  -2.430127 3.737585 -1.388527
C  -1.472654 -4.100726 1.405881
C  -3.631902 3.233501 -0.835527
C  -2.75514 -3.833461 0.869248
C  -3.436311 0.306617 2.32956
C  -3.159913 -0.926095 -2.290602
C  -2.978099 -0.682058 3.397281
C  -2.91252 0.12025 -3.372888
H  6.575158 0.054073 0.656169
H  6.420112 1.396596 -0.515824
H  5.391143 2.08438 1.589534
H  4.451177 0.577495 1.716056
H  4.673135 0.275478 -1.760466
H  5.978651 -0.910936 -1.495039
H  2.371865 1.053729 1.52066
H  2.703278 -0.524889 -1.513814
H  0.093513 1.108106 1.50849
H  0.46685 -1.007988 -1.485799
H  -0.246064 3.655718 -1.301568
H  0.654821 -3.606263 1.292305
H  -4.536363 1.906874 0.627012
H  -3.912747 -2.702316 -0.578872
H  -2.4624 4.483258 -2.189418
H  -1.352616 -4.839188 2.205159
H  -4.599745 3.588275 -1.207406
H  -3.633525 -4.36503 1.252402
H  -4.02423 -0.202693 1.538639
H  -4.049805 1.121893 2.765142
H  -3.819178 -0.527185 -1.492637
H  -3.616922 -1.845934 -2.70974
H  -2.375416 -1.488447 2.94672
H  -2.372502 -0.172909 4.166552
H  -3.856751 -1.136955 3.89018
H  -2.461199 1.028041 -2.938914
H  -2.237953 -0.275253 -4.151507
H  -3.86955 0.400984 -3.849451
