program: Gaussian 09
title: 000267000
version: EM64L-G09RevD.01
frameworkgroup: C1[X(C10H18O2)]
method: RPBEPBE
basis: SDD
operation: Freq
keyword: #pfreq=noraman
keyword: PBEPBE/SDD
title: #p freq=noraman PBEPBE/SDD
converged: YES YES NO NO
title: Mulliken charges:
elementType: O O C C C C C C C C C C H H H H H H H H H H H H H H H H H H
charge: -0.280195 -0.218965 -0.078948 -0.505851 -0.379759 -0.398835 -0.513533 -0.256993 -0.386796 0.254221 -0.238010 -0.723622 0.252825 0.227270 0.192642 0.188381 0.244779 0.190257 0.200016 0.200421 0.168333 0.215581 0.222163 0.180502 0.224705 0.175463 0.194014 0.217275 0.226695 0.205962
chargesum: 0.00000
title: Mulliken charges with hydrogens summed into heavy atoms:
elementType: O O C C C C C C C C C C
charge: -0.280195 -0.218965 0.173876 -0.085939 0.053400 -0.008561 -0.075789 0.111761 0.018411 0.254221 0.131468 -0.073689
polarizability: 1.31863935e+02 1.51050553e+00 1.09747069e+02 -2.43798398e-01 -7.33012922e-01 9.45212489e+01
1716.lowfreq: -6.1380 -0.0007 -0.0005 0.0002 12.0535 13.3924 62.6418 84.4830 99.1866
frequency: 62.4491 84.4361 99.1676 114.4533 175.7653 180.5707 203.6960 237.9648 256.2555 276.1923 312.8454 318.7764 363.4572 402.9551 436.0077 445.5907 491.1179 515.3178 598.6796 741.1761 785.6138 823.8920 837.2901 849.1268 882.3320 891.1055 920.8732 941.0880 949.5394 982.4413 1000.2088 1033.4793 1056.9438 1076.7598 1094.0804 1109.0782 1115.5652 1132.3447 1154.1824 1169.2655 1182.9302 1194.4941 1225.0539 1244.9696 1260.6136 1270.5466 1278.0000 1304.1887 1321.3456 1333.0461 1343.3467 1348.3811 1356.6395 1361.8593 1387.1715 1397.9475 1436.4087 1445.3764 1452.0495 1463.3181 1470.7958 1476.3711 1477.8021 1478.4200 1485.7638 1625.0179 2901.8997 2911.0749 2950.5597 2951.8939 2958.9700 2965.2612 2971.6399 2980.8943 2981.5139 2985.9072 3009.9753 3012.8691 3034.7760 3038.3068 3044.2927 3049.3366 3064.9579 3077.3034
redmass: 2.7730 3.5907 2.5537 3.0877 3.4575 4.1027 1.1501 2.2404 3.7200 3.2098 1.7432 2.2660 2.7790 2.6924 2.2332 2.0951 2.4418 2.5787 3.3094 2.7087 2.1702 1.6828 2.3656 2.9242 1.5678 2.0661 2.0481 1.5493 1.5334 2.3879 2.3078 2.8879 1.6873 3.6008 2.6878 2.2496 2.0946 1.8628 1.6396 1.3768 1.2974 1.2754 1.1727 1.2266 1.1875 1.1381 1.3534 1.2721 1.5104 1.3644 1.5706 1.3901 1.4363 1.3736 1.2494 1.4100 1.0865 1.0844 1.0966 1.0877 1.0859 1.0494 1.0766 1.0603 1.0794 8.1884 1.0572 1.0575 1.0663 1.0639 1.0945 1.0999 1.0370 1.0640 1.0676 1.0640 1.0855 1.0936 1.0927 1.1007 1.0997 1.1016 1.0990 1.0991
irintensity: 1.2546 0.5722 0.9385 1.8583 11.0616 2.6069 0.0307 2.4735 7.4181 2.5222 1.7774 0.0920 1.2038 1.2848 1.8121 0.3884 2.9589 2.8021 3.1557 7.1412 2.8908 1.2669 2.0803 11.1245 0.8583 4.2487 11.8821 4.6312 1.4632 5.6376 5.3019 16.3801 28.4918 114.9205 10.8721 3.2168 7.0355 27.1184 6.5647 23.3251 15.9226 2.2584 2.7819 8.2018 1.8971 2.7067 16.1252 12.9075 35.6774 8.3430 6.6394 10.9237 2.7508 0.9391 14.2600 1.4504 14.2769 13.0959 11.8361 14.9215 0.6600 12.6923 15.3892 13.2670 12.8653 106.4139 19.1012 115.3815 21.2475 27.8394 54.1377 47.2072 43.0967 48.5518 11.2235 62.5510 11.7584 70.6836 31.2095 18.6140 39.3753 29.2047 60.1743 36.4194
temp: 298.150 k
press: 1.00000 atm
elementType: 8 8 6 6 6 6 6 6 6 6 6 6 1 1 1 1 1 1 1 1 1 1 1 1 1 1 1 1 1 1
symmnumber: 1
zpe: 691653.1 jmol-1
zpe.correction: 0.263437 hartree
zpe.thermalcorrener: 0.276246 hartree
zpe.thermalcorrenthalpy: 0.277190 hartree
zpe.thermalcorrgfe: 0.224943 hartree
zpe.sumelectzpe: -541.311910 hartree
zpe.sumelectthermal: -541.299101 hartree
zpe.sumelectthermalent: -541.298157 hartree
zpe.sumelectthermalfe: -541.350404 hartree
dipole: 0.3948 2.6575 -3.2145
dipole: 4.1895
quadrupole: -67.6674 -73.9936 -77.8276
quadrupole: -0.3542 -0.3446 5.0503
quadrupole: 5.4954 -0.8307 -4.6647 -0.3542 -0.3446 5.0503
hfenergy: -541.575347 hartree
pointgroup: C01 [X(C10H18O2)]
dipole: 0.0268757 0.9996013 -1.3102853 debye
polarizability: 131.1929542|4.0643995|110.3182588|-0.4197179|-1.4659603|94.6210396 unknown
InChI: InChI=1S/C10H18O2/c1-9-7-10(11)5-3-2-4-6-12-8-9/h9H,2-8H2,1H3
charge 0 multiplicity 1
30 atoms
O  -0.127402 1.174907 0.369931
O  0.409921 -1.713315 1.391935
C  2.195625 0.568548 0.207681
C  1.778288 -0.8050 -0.398509
C  -2.126388 -1.400856 -0.052842
C  -2.97139 -0.127187 -0.330448
C  -0.742755 -1.449183 -0.752413
C  1.157181 1.645021 -0.149776
C  -2.561034 1.183278 0.392625
C  0.458219 -1.323198 0.193749
C  -1.304333 1.897658 -0.124474
C  3.60499 0.987517 -0.262965
H  2.192888 0.453136 1.309291
H  2.570295 -1.540527 -0.158328
H  1.710292 -0.718143 -1.500837
H  -2.728474 -2.273444 -0.372191
H  -1.963691 -1.517483 1.036198
H  -3.011633 0.05791 -1.425437
H  -4.013453 -0.35149 -0.023141
H  1.423936 2.622576 0.308663
H  1.102526 1.780513 -1.255858
H  -0.66329 -0.677554 -1.539982
H  -0.612792 -2.424545 -1.272186
H  -3.402338 1.901228 0.305135
H  -2.420458 0.988162 1.473641
H  -1.292424 1.929087 -1.238954
H  -1.273112 2.945285 0.249248
H  3.904507 1.957091 0.177133
H  4.356577 0.235382 0.037174
H  3.647821 1.08572 -1.364965
