program: Gaussian 09
title: 000266999
version: EM64L-G09RevD.01
frameworkgroup: C1[X(C10H16O)]
method: RPBEPBE
basis: SDD
operation: Freq
keyword: #pfreq=noraman
keyword: PBEPBE/SDD
title: #p freq=noraman PBEPBE/SDD
converged: YES YES NO YES
title: Mulliken charges:
elementType: O C C C C C C C C C C H H H H H H H H H H H H H H H H
charge: -0.264441 0.239095 -0.068382 -0.520330 -0.520114 0.120252 -0.410852 -0.489644 -0.399886 -0.336058 -0.730246 0.233495 0.204329 0.214414 0.207471 0.209699 0.201505 0.201651 0.220982 0.228163 0.206855 0.202025 0.190540 0.216517 0.219089 0.216969 0.206902
chargesum: 0.00000
title: Mulliken charges with hydrogens summed into heavy atoms:
elementType: O C C C C C C C C C C
charge: -0.264441 0.239095 0.165114 -0.101587 -0.102944 0.120252 -0.007696 -0.040499 0.008993 0.070999 -0.087286
polarizability: 1.26068032e+02 -6.54482764e-01 1.10217035e+02 1.11899258e+00 2.09063887e-01 8.00324485e+01
1716.lowfreq: -17.1992 0.0006 0.0008 0.0010 5.8172 10.2795 72.1347 124.1388 140.9355
frequency: 72.0478 124.1276 140.9067 204.5108 215.9911 234.9955 292.0047 315.0385 343.4142 372.3229 411.6612 444.2957 463.2982 540.7625 549.6104 638.3163 687.2134 815.6992 835.6384 859.8867 864.6992 880.2001 903.5534 925.8619 953.8967 978.6939 983.5884 1069.6686 1072.1509 1085.6916 1089.9931 1125.6090 1134.0663 1143.0835 1166.1031 1170.9460 1186.1677 1202.1892 1235.6081 1255.0219 1259.6158 1287.8214 1308.7777 1331.2891 1336.7987 1339.3561 1346.6217 1358.5545 1365.0185 1391.2852 1451.4365 1456.5561 1462.0872 1465.1516 1467.9765 1474.0346 1477.4705 1477.7815 1700.7604 2927.4021 2932.1301 2956.4569 2968.0816 2968.8297 2969.5379 2977.1834 2980.4057 2986.2657 2999.4532 3023.3899 3038.5183 3048.4888 3062.4733 3070.3662 3075.6121
redmass: 2.9131 2.2991 2.0852 1.0654 2.7783 2.7283 1.8244 2.2829 2.8949 3.8152 2.5881 2.4042 3.4234 2.9910 4.1560 3.2410 3.1983 1.4001 2.4234 1.8202 2.3543 1.7939 1.5358 1.6989 1.5999 2.8123 2.6289 1.4937 2.4146 2.0465 1.7068 3.3981 1.3455 1.6457 1.8727 1.7670 1.5317 1.8577 1.3033 1.2607 1.2243 1.3309 1.4184 1.4134 1.5656 1.4362 1.6517 2.1337 1.4801 1.2116 1.0949 1.0921 1.0853 1.0916 1.0848 1.0958 1.0526 1.0488 7.2166 1.0622 1.0638 1.0670 1.0647 1.0800 1.0375 1.0879 1.0631 1.0757 1.0887 1.0952 1.0990 1.1040 1.0986 1.0994 1.0985
irintensity: 1.0058 0.1674 0.3047 0.1877 4.0666 3.9053 3.4571 3.0630 2.0664 0.3320 0.2408 0.7326 0.4781 2.2140 3.1786 5.2357 1.8418 3.7391 3.2154 7.1541 7.6640 6.8851 1.9219 4.7716 4.6087 22.5551 22.4522 0.9168 10.5861 1.8732 1.7347 100.5847 1.0386 4.9732 9.0156 15.7091 4.1876 13.1786 2.8597 6.9424 0.9707 4.5133 4.6994 1.6477 0.4459 5.3052 0.5981 11.2524 1.6170 15.7990 0.6229 3.9796 6.8045 9.8023 11.5003 4.1819 12.8350 10.4540 36.5228 12.6139 91.4833 43.8286 38.0057 13.3468 43.2188 15.6437 33.3897 67.4247 52.6583 23.4149 67.7652 73.7178 36.8835 22.7944 64.7193
temp: 298.150 k
press: 1.00000 atm
elementType: 8 6 6 6 6 6 6 6 6 6 6 1 1 1 1 1 1 1 1 1 1 1 1 1 1 1 1
symmnumber: 1
zpe: 626433.6 jmol-1
zpe.correction: 0.238596 hartree
zpe.thermalcorrener: 0.249137 hartree
zpe.thermalcorrenthalpy: 0.250081 hartree
zpe.thermalcorrgfe: 0.203119 hartree
zpe.sumelectzpe: -465.007073 hartree
zpe.sumelectthermal: -464.996532 hartree
zpe.sumelectthermalent: -464.995588 hartree
zpe.sumelectthermalfe: -465.042550 hartree
dipole: 0.6034 -1.3329 0.1352
dipole: 1.4694
quadrupole: -61.8959 -70.2063 -67.4562
quadrupole: -0.2584 0.3269 0.4704
quadrupole: 4.6236 -3.6868 -0.9367 -0.2584 0.3269 0.4704
hfenergy: -465.2456689 hartree
pointgroup: C01 [X(C10H16O1)]
dipole: -0.2323137 -0.5270762 -0.049132 debye
polarizability: 126.0449417|0.8146719|110.2241498|1.2948462|-0.4813446|80.0484241 unknown
InChI: InChI=1S/C10H16O/c1-8-6-9-4-2-3-5-10(9)11-7-8/h8H,2-7H2,1H3
charge 0 multiplicity 1
27 atoms
O  -0.586603 1.665234 -0.075528
C  0.248234 -0.644577 -0.035833
C  -2.225503 -0.174888 0.359671
C  -1.153758 -1.235718 0.006326
C  1.420406 -1.615739 -0.038402
C  0.457088 0.704195 -0.030571
C  2.769123 -0.934855 -0.368924
C  1.808133 1.381174 0.034798
C  2.921318 0.381864 0.42716
C  -1.913298 1.114104 -0.423893
C  -3.657302 -0.665367 0.064527
H  -2.136619 0.066506 1.438252
H  -1.404265 -1.708973 -0.96926
H  -1.184523 -2.056394 0.753234
H  1.48874 -2.116389 0.952934
H  1.221178 -2.428389 -0.768999
H  3.606021 -1.623863 -0.145595
H  2.812933 -0.707816 -1.453093
H  2.03382 1.845443 -0.947092
H  1.748777 2.214898 0.761273
H  3.914268 0.836239 0.248523
H  2.854559 0.160324 1.511087
H  -1.934802 0.907404 -1.515585
H  -2.624578 1.924677 -0.19194
H  -3.862223 -1.61746 0.587903
H  -4.41551 0.070343 0.391787
H  -3.799115 -0.842174 -1.019459
