program: Gaussian 09
title: 000266997
version: EM64L-G09RevD.01
frameworkgroup: C1[X(C10H16O3)]
method: RPBEPBE
basis: SDD
operation: Freq
keyword: #pfreq=noraman
keyword: PBEPBE/SDD
title: #p freq=noraman PBEPBE/SDD
converged: NO YES NO NO
title: Mulliken charges:
elementType: O O O C C C C C C C C C C H H H H H H H H H H H H H H H H
charge: -0.273106 -0.218181 -0.250189 -0.150863 -0.412951 -0.559676 -0.386450 0.263140 -0.386775 -0.295297 -0.725821 -0.487431 0.250058 0.207676 0.244380 0.208229 0.237677 0.251512 0.223605 0.197950 0.199028 0.260634 0.237641 0.223646 0.243403 0.215391 0.218510 0.231863 0.232399
chargesum: 0.00000
title: Mulliken charges with hydrogens summed into heavy atoms:
elementType: O O O C C C C C C C C C C
charge: -0.273106 -0.218181 -0.250189 0.056812 0.039657 -0.070487 0.035104 0.263140 0.072887 0.165990 -0.048517 -0.023169 0.250058
polarizability: 1.25597599e+02 6.37342920e+00 1.11544755e+02 -3.25521712e+00 2.46760300e+00 9.76470285e+01
1716.lowfreq: -14.7455 0.0000 0.0006 0.0007 8.0762 14.4216 29.5108 61.7426 93.1700
frequency: 29.1284 61.5954 93.0729 169.2111 176.9682 194.5574 214.4577 224.5331 229.1320 257.8883 280.9736 306.3584 326.7241 366.0775 439.3300 460.7557 505.5981 560.2100 569.4314 618.1147 637.0971 741.7190 768.8452 797.2913 810.6850 831.9172 884.0145 906.4426 942.2930 952.3151 962.6336 988.1738 1036.9756 1050.0780 1058.1991 1075.0566 1092.0903 1093.8276 1137.5394 1149.9009 1165.2120 1201.1181 1213.5710 1229.0841 1232.4825 1269.7287 1290.9273 1324.4429 1329.2270 1339.6082 1341.7340 1351.7415 1354.4457 1360.7721 1385.8512 1443.3009 1446.4849 1448.5193 1454.9123 1470.9438 1471.0041 1478.1382 1482.4331 1625.5308 1634.9305 2955.2922 2982.6533 2984.7306 2986.6262 2988.3171 2992.4410 3004.9361 3012.3991 3028.6716 3051.4749 3052.6263 3059.2714 3078.3335 3080.6633 3082.6436 3092.6475
redmass: 4.0413 5.0818 6.5359 4.5314 2.7209 2.3229 2.3595 1.9620 2.1017 2.7696 2.3791 2.5812 2.4669 2.6572 3.2849 2.5319 2.5886 3.6895 2.5928 3.3630 2.5605 2.4245 3.2225 2.6475 2.4048 2.0533 2.2450 2.2975 2.2259 1.9481 1.5284 2.5151 2.2329 2.0858 2.6502 2.5435 1.7947 1.7636 1.9741 2.0927 1.3618 1.7439 1.4978 1.2754 1.1731 1.2788 1.2419 1.3508 1.3804 1.4835 1.4365 1.4224 1.4389 1.3967 1.2134 1.0828 1.0914 1.0806 1.0851 1.0548 1.0725 1.0850 1.0549 7.3810 10.1237 1.0665 1.0388 1.0633 1.0588 1.0631 1.0822 1.0657 1.0587 1.0925 1.1001 1.0977 1.0982 1.1001 1.0973 1.1075 1.1002
irintensity: 0.9489 1.8430 3.8167 5.3873 0.0662 3.5272 7.0677 2.3723 2.6461 0.4079 3.4588 8.8649 3.9012 4.7284 1.3758 1.3439 5.4141 1.8360 1.8549 4.3661 0.5984 1.7356 17.5073 6.6326 4.3580 1.7629 11.8951 19.4029 8.3700 8.3185 7.4273 32.8256 42.2283 88.9641 4.1810 1.5956 28.8816 18.7275 23.8592 71.6784 31.7669 35.0253 41.7244 9.5521 5.9947 35.2520 1.1749 0.7411 13.5839 12.9296 1.4989 3.1393 5.3705 15.3344 19.8847 15.5184 23.3944 6.9965 18.5859 23.8858 5.7619 22.9779 11.7425 45.1218 208.3102 18.0994 25.2773 25.2975 30.9022 28.3702 18.9903 53.4264 37.2077 2.9262 3.0064 43.4500 1.9802 34.2691 28.3823 16.3634 25.6872
temp: 298.150 k
press: 1.00000 atm
elementType: 8 8 8 6 6 6 6 6 6 6 6 6 6 1 1 1 1 1 1 1 1 1 1 1 1 1 1 1 1
symmnumber: 1
zpe: 644674.0 jmol-1
zpe.correction: 0.245543 hartree
zpe.thermalcorrener: 0.258767 hartree
zpe.thermalcorrenthalpy: 0.259712 hartree
zpe.thermalcorrgfe: 0.205906 hartree
zpe.sumelectzpe: -615.310277 hartree
zpe.sumelectthermal: -615.297053 hartree
zpe.sumelectthermalent: -615.296109 hartree
zpe.sumelectthermalfe: -615.349914 hartree
dipole: 0.6844 0.2880 0.7099
dipole: 1.0273
quadrupole: -73.9373 -80.2868 -82.3375
quadrupole: 9.6165 6.6847 -8.9425
quadrupole: 4.9166 -1.4329 -3.4836 9.6165 6.6847 -8.9425
hfenergy: -615.5558202 hartree
pointgroup: C01 [X(C10H16O3)]
dipole: -0.251455 -0.1447877 0.2813791 debye
polarizability: 123.9758499|7.8136194|113.2381516|3.293651|-2.1091163|97.5753809 unknown
InChI: InChI=1S/C10H16O3/c1-8-6-7-13-10(12)5-3-2-4-9(8)11/h8H,2-7H2,1H3
charge 0 multiplicity 1
29 atoms
O  0.734311 -1.098908 -0.720555
O  -1.431055 1.467709 -1.014206
O  2.007198 -1.643381 1.161793
C  -1.948058 -0.389126 0.476682
C  -1.666334 -1.545368 -0.529369
C  -0.090715 1.405419 1.025243
C  1.010225 2.256656 0.347668
C  -1.157263 0.874064 0.064077
C  1.835778 1.523855 -0.739646
C  -0.267258 -2.159938 -0.409075
C  -3.462351 -0.056874 0.504182
C  2.639869 0.292127 -0.246923
C  1.800074 -0.906046 0.170126
H  -1.621471 -0.7073 1.486706
H  -1.826628 -1.16372 -1.555403
H  -2.40317 -2.356166 -0.359584
H  -0.625403 2.034307 1.771559
H  0.334405 0.568693 1.609906
H  0.530232 3.132494 -0.127414
H  1.687717 2.642787 1.135529
H  2.558277 2.246843 -1.165811
H  1.167462 1.217592 -1.562459
H  -0.059521 -2.555083 0.602133
H  -0.115291 -2.961317 -1.153496
H  -3.790272 0.289285 -0.491604
H  -4.050789 -0.949998 0.782546
H  -3.688775 0.742353 1.23308
H  3.288511 0.545615 0.61058
H  3.304892 -0.048578 -1.065962
