program: Gaussian 09
title: 000266996
version: EM64L-G09RevD.01
frameworkgroup: C1[X(C10H16O)]
method: RPBEPBE
basis: SDD
operation: Freq
keyword: #pfreq=noraman
keyword: PBEPBE/SDD
title: #p freq=noraman PBEPBE/SDD
converged: YES YES NO NO
title: Mulliken charges:
elementType: O C C C C C C C C C C H H H H H H H H H H H H H H H H
charge: -0.283229 0.215005 -0.517053 -0.412526 -0.490478 0.141374 -0.395721 -0.496032 -0.409252 -0.388638 -0.311339 0.207967 0.214227 0.204691 0.210271 0.202481 0.200118 0.206602 0.201272 0.219137 0.230161 0.198557 0.223969 0.196574 0.215667 0.203652 0.212543
chargesum: 0.00000
title: Mulliken charges with hydrogens summed into heavy atoms:
elementType: O C C C C C C C C C C
charge: -0.283229 0.215005 -0.094859 -0.009927 -0.075516 0.141374 0.012154 -0.046733 0.013274 0.023602 0.104856
polarizability: 1.22618973e+02 1.37397885e+00 1.11084359e+02 -1.48725059e+00 1.01629021e+00 8.18727611e+01
1716.lowfreq: -18.6725 -4.2210 -0.0005 0.0002 0.0003 15.7364 69.9254 123.8661 142.2618
frequency: 69.6713 123.8035 142.2109 217.8439 259.0916 275.7190 301.7890 337.9050 351.1482 388.2084 439.0229 483.7639 535.3325 582.5657 617.3663 641.9052 774.4177 807.0189 821.3953 833.9723 868.0957 887.0188 912.3511 943.9373 969.9197 982.3875 1010.2041 1068.5471 1083.3935 1088.4506 1092.9423 1111.1940 1133.4014 1143.0985 1166.0158 1178.7670 1181.3050 1229.0248 1237.6477 1246.7674 1260.6692 1268.4562 1324.1477 1331.0161 1335.3432 1340.2537 1345.7536 1353.7709 1358.8040 1373.3958 1453.4408 1455.2153 1456.9852 1460.0176 1467.0579 1471.3051 1471.9827 1473.1922 1688.6684 2929.7962 2936.3860 2965.9980 2968.2602 2970.6220 2976.8190 2980.0958 2985.0481 2985.9625 2998.4189 3020.3065 3031.7534 3037.6671 3047.9525 3053.8821 3067.9482
redmass: 2.8941 2.3988 2.2597 1.9355 2.6859 2.7013 1.7230 4.2405 2.2878 3.6359 3.3874 2.0885 3.3535 2.4740 2.2716 3.7583 1.4865 2.1272 1.6466 2.5318 2.3966 1.9067 1.5338 2.2644 2.1792 2.2384 2.1562 1.6717 2.0149 1.7864 2.3581 2.2147 1.3079 1.9556 1.9009 1.8088 1.5386 1.4475 1.2986 1.1915 1.2131 1.1445 1.4712 1.4364 1.5520 1.4211 1.5485 1.4478 1.6792 1.3102 1.1096 1.0823 1.0822 1.0825 1.0854 1.0884 1.0831 1.0962 6.9730 1.0614 1.0646 1.0631 1.0815 1.0611 1.0752 1.0632 1.0746 1.0745 1.0728 1.0951 1.0978 1.0990 1.1040 1.1013 1.1039
irintensity: 1.7473 0.3071 1.1533 1.2174 3.6575 4.0346 1.4791 0.0219 4.3347 1.1999 0.6389 1.1282 3.2661 3.0540 4.8004 1.5517 3.4536 2.0242 7.9522 11.8136 2.2928 3.0271 0.8596 26.2125 6.5581 11.1596 5.2332 3.7369 17.8992 0.4093 38.9828 35.0987 1.0371 33.6176 1.8271 44.1911 13.1713 2.2369 3.6433 3.3481 2.2913 5.5430 15.8941 0.9441 0.9528 3.0704 2.0374 2.5447 8.8316 1.8657 1.6818 4.4922 2.8650 10.8395 11.5615 12.0969 16.1837 2.3586 38.1663 28.2666 69.1475 35.1626 14.5124 14.1219 12.8830 38.2660 67.4204 89.0753 59.6577 21.4739 24.3389 68.2220 72.7963 52.3829 53.3289
temp: 298.150 k
press: 1.00000 atm
elementType: 8 6 6 6 6 6 6 6 6 6 6 1 1 1 1 1 1 1 1 1 1 1 1 1 1 1 1
symmnumber: 1
zpe: 629146.1 jmol-1
zpe.correction: 0.239629 hartree
zpe.thermalcorrener: 0.249759 hartree
zpe.thermalcorrenthalpy: 0.250703 hartree
zpe.thermalcorrgfe: 0.204564 hartree
zpe.sumelectzpe: -464.995102 hartree
zpe.sumelectthermal: -464.984972 hartree
zpe.sumelectthermalent: -464.984028 hartree
zpe.sumelectthermalfe: -465.030167 hartree
dipole: -0.3511 1.1818 0.7253
dipole: 1.4304
quadrupole: -62.3785 -68.8836 -67.2637
quadrupole: -0.9529 -1.7430 -1.1334
quadrupole: 3.7967 -2.7083 -1.0884 -0.9529 -1.7430 -1.1334
hfenergy: -465.2347308 hartree
pointgroup: C01 [X(C10H16O1)]
dipole: -0.1377587 0.4690803 0.2787086 debye
polarizability: 122.5639601|1.4198202|111.1271041|-1.9695151|0.4776032|81.8850288 unknown
InChI: InChI=1S/C10H16O/c1-2-7-10-9(5-1)6-3-4-8-11-10/h1-8H2
charge 0 multiplicity 1
27 atoms
O  -0.861151 -1.509215 -0.015123
C  0.237683 0.711348 0.113357
C  1.543381 1.500432 0.215654
C  2.790543 0.619617 0.450194
C  -1.025066 1.577205 0.086341
C  0.273042 -0.649232 -0.017492
C  2.766857 -0.597523 -0.498771
C  1.532767 -1.474881 -0.194415
C  -2.21594 0.980827 -0.705483
C  -2.968853 -0.147167 0.043292
C  -2.010913 -1.073809 0.807884
H  1.679282 2.096721 -0.713796
H  1.449311 2.244957 1.034725
H  -1.348215 1.848586 1.115576
H  -0.740328 2.539668 -0.387376
H  3.709377 1.218177 0.300014
H  2.802403 0.260684 1.499039
H  3.690513 -1.198103 -0.397171
H  2.722861 -0.241259 -1.547313
H  1.703367 -2.078131 0.720965
H  1.352521 -2.204229 -1.008548
H  -2.932755 1.786688 -0.957488
H  -1.829214 0.58625 -1.663625
H  -3.682314 0.283476 0.776061
H  -3.565017 -0.734064 -0.680846
H  -1.615281 -0.570543 1.712675
H  -2.514761 -2.009281 1.108769
