program: Gaussian 09
title: 000266994
version: EM64L-G09RevD.01
frameworkgroup: C1[X(C11H18O)]
method: RPBEPBE
basis: SDD
operation: Freq
keyword: #pfreq=noraman
keyword: PBEPBE/SDD
title: #p freq=noraman PBEPBE/SDD
converged: YES YES NO NO
title: Mulliken charges:
elementType: O C C C C C C C C C C C H H H H H H H H H H H H H H H H H H
charge: -0.262017 -0.185923 -0.035198 -0.460017 0.272858 -0.509975 0.101297 -0.518298 -0.422184 -0.740952 -0.744703 -0.312417 0.199140 0.213729 0.206345 0.191266 0.228770 0.218506 0.209802 0.214793 0.202483 0.224352 0.218885 0.220210 0.214274 0.208436 0.217287 0.214209 0.196296 0.218749
chargesum: 0.00000
title: Mulliken charges with hydrogens summed into heavy atoms:
elementType: O C C C C C C C C C C C
charge: -0.262017 0.013216 0.178530 -0.062406 0.272858 -0.062700 0.101297 -0.093703 0.004651 -0.087583 -0.104771 0.102628
polarizability: 1.34541541e+02 -7.18812176e-01 1.24070071e+02 -1.29814760e+00 -1.75969731e+00 9.03707073e+01
1716.lowfreq: -15.5315 -13.4737 -7.1155 -0.0001 0.0002 0.0004 68.0303 88.0087 139.2466
frequency: 67.8910 87.9979 139.2460 162.8599 189.0960 216.8364 223.9321 238.5394 283.3687 319.9112 361.7434 371.6195 397.7433 447.4232 469.8775 496.6985 557.6735 571.3664 653.2652 687.8315 807.1416 843.1514 859.6989 864.9635 878.9921 904.2053 916.5615 936.7110 967.0291 999.8327 1013.7636 1045.7076 1063.5052 1073.8437 1089.9242 1109.5215 1141.0816 1142.4704 1160.9542 1170.4300 1180.7762 1195.0010 1227.1348 1249.3080 1260.2922 1278.7452 1292.1349 1305.0467 1321.4731 1337.3873 1338.4352 1353.2674 1358.5152 1366.2207 1377.7451 1385.5481 1453.6183 1454.8786 1460.7998 1464.6290 1471.2642 1473.5482 1476.1234 1476.4421 1480.2464 1686.7157 2931.4558 2946.3687 2956.1367 2962.7282 2965.9376 2971.5035 2972.9437 2974.2660 2990.4888 3004.3752 3019.6761 3027.0304 3058.9774 3060.6851 3065.2844 3066.6575 3073.8397 3081.3780
redmass: 2.9711 2.4348 2.5005 2.9486 1.2590 1.1021 1.9732 2.2335 2.0716 2.1905 3.2728 3.2715 2.6938 2.5483 2.7346 3.3044 3.6929 2.9311 3.2327 2.6559 2.6797 2.3633 1.5382 2.3554 1.5930 1.6370 2.5148 1.7925 1.7918 1.5316 1.5361 2.1553 2.9166 1.7442 1.8040 1.8443 2.3759 2.6702 1.5605 1.5973 1.6830 1.4909 1.5483 1.3601 1.2095 1.5522 1.4511 1.3543 1.4154 1.4539 1.4767 1.8373 1.5536 1.5101 1.2244 1.2219 1.0920 1.0835 1.0968 1.0795 1.0749 1.0685 1.0551 1.0551 1.0575 7.6981 1.0802 1.0630 1.0666 1.0595 1.0427 1.0583 1.0462 1.0726 1.0792 1.0770 1.0997 1.0979 1.1019 1.0991 1.0993 1.0992 1.0996 1.0994
irintensity: 0.8573 1.1407 1.2206 2.8243 0.3891 0.0883 0.5185 1.0957 2.3935 2.9624 1.1668 2.1383 1.9244 0.4790 0.1749 1.0380 5.4719 2.2505 2.8800 0.5080 2.9522 0.6621 2.9244 6.7655 4.0658 7.3790 14.5171 8.5797 1.8463 8.3001 23.6469 2.1716 51.5251 9.3399 15.6058 11.5457 5.9557 50.5524 3.6969 6.4973 5.1986 2.3839 22.1414 2.1950 4.8467 3.3449 20.6437 5.0422 9.1838 1.6036 4.6248 9.4413 7.3590 6.6339 14.4974 11.7756 5.0604 4.1773 4.7414 12.0452 5.1761 2.6858 11.1836 9.9313 13.3004 50.3017 27.3354 51.0011 17.6436 30.2625 43.1142 50.6768 54.7599 54.9369 18.6657 58.3136 32.4905 28.2916 44.5561 61.1558 28.1706 68.0825 47.0278 42.2767
temp: 298.150 k
press: 1.00000 atm
elementType: 8 6 6 6 6 6 6 6 6 6 6 6 1 1 1 1 1 1 1 1 1 1 1 1 1 1 1 1 1 1
symmnumber: 1
zpe: 698556.0 jmol-1
zpe.correction: 0.266066 hartree
zpe.thermalcorrener: 0.278110 hartree
zpe.thermalcorrenthalpy: 0.279054 hartree
zpe.thermalcorrgfe: 0.228795 hartree
zpe.sumelectzpe: -504.229259 hartree
zpe.sumelectthermal: -504.217215 hartree
zpe.sumelectthermalent: -504.216271 hartree
zpe.sumelectthermalfe: -504.266530 hartree
dipole: -0.6672 1.2910 -0.0086
dipole: 1.4533
quadrupole: -67.7385 -77.1972 -74.2486
quadrupole: -1.5450 -0.4202 -0.4051
quadrupole: 5.3229 -4.1358 -1.1871 -1.5450 -0.4202 -0.4051
hfenergy: -504.4953248 hartree
pointgroup: C01 [X(C11H18O1)]
dipole: 0.2537432 -0.5123596 0.0046332 debye
polarizability: 134.5057133|-0.8827249|124.1404743|1.4676819|1.2535573|90.336132 unknown
InChI: InChI=1S/C11H18O/c1-8-6-9(2)10-4-3-5-12-11(10)7-8/h8-9H,3-7H2,1-2H3
charge 0 multiplicity 1
30 atoms
O  1.458007 1.648478 0.222009
C  -0.680001 -1.520496 -0.307478
C  -2.141577 0.533925 0.241115
C  -1.962727 -0.717978 -0.65275
C  0.532394 -0.607296 -0.13005
C  -0.936328 1.483071 0.036805
C  0.381954 0.740176 0.039647
C  1.91653 -1.244478 -0.188431
C  3.007128 -0.182984 -0.459873
C  -0.888922 -2.439092 0.932069
C  -3.476265 1.253718 -0.043302
C  2.780004 1.026544 0.459132
H  -0.463491 -2.19299 -1.167228
H  -2.142402 0.206185 1.301583
H  -1.915056 -0.385885 -1.710729
H  -2.848605 -1.378147 -0.56122
H  -0.910791 2.257186 0.827671
H  -1.047136 2.027443 -0.924935
H  2.145132 -1.784021 0.755176
H  1.932543 -2.013251 -0.98757
H  4.019917 -0.594316 -0.28856
H  2.953708 0.152818 -1.512671
H  0.024083 -3.018246 1.162532
H  -1.142221 -1.843034 1.82782
H  -1.708931 -3.159788 0.75137
H  -3.537284 1.561544 -1.105271
H  -4.338822 0.594167 0.167149
H  -3.584165 2.162869 0.577861
H  2.830635 0.717644 1.523844
H  3.506486 1.836436 0.280981
