program: Gaussian 09
title: 000266993
version: EM64L-G09RevD.01
frameworkgroup: C1[X(C16H20NP)]
method: RPBEPBE
basis: SDD
operation: Freq
keyword: #p
keyword: freq=noraman
keyword: PBEPBE/SDD
title: #p freq=noraman PBEPBE/SDD
converged: YES YES NO NO
title: Mulliken charges:
elementType: P N C C C C C C C C C C C C C C C C H H H H H H H H H H H H H H H H H H H H
charge: 0.724559 -0.758905 0.323167 -0.714462 -0.684145 -0.671227 -0.181269 -0.198539 -0.282756 -0.230463 -0.280617 -0.295722 -0.225745 -0.235116 -0.223879 -0.221678 -0.238656 -0.232176 0.311441 0.227717 0.212383 0.205603 0.230264 0.222226 0.201353 0.209384 0.203083 0.215984 0.245796 0.267165 0.275620 0.235403 0.226423 0.229120 0.224406 0.228517 0.226277 0.229465
chargesum: 0.00000
title: Mulliken charges with hydrogens summed into heavy atoms:
elementType: P N C C C C C C C C C C C C C C C C
charge: 0.724559 -0.447464 0.323167 -0.068759 -0.030303 -0.042776 -0.181269 -0.198539 -0.036960 0.036701 -0.004997 -0.060319 0.000678 -0.005996 0.000527 0.006839 -0.012378 -0.002711
polarizability: 2.35214639e+02 1.16939509e+01 2.25356104e+02 -1.59519487e+01 -8.03429180e+00 1.46569278e+02
1716.lowfreq: -8.0065 -6.0449 -0.0015 -0.0009 0.0016 9.9545 13.1578 33.3047 38.7289
frequency: 11.1725 33.0881 38.6779 44.0422 57.6795 73.9144 140.4400 168.8265 189.3152 194.6501 208.2749 238.9284 255.8459 261.4378 272.8506 324.2235 332.8371 377.0771 394.0267 394.9123 401.3237 422.1348 426.1442 456.3324 470.7168 496.6947 510.5977 612.8930 613.6531 667.3958 673.6793 701.1274 705.6434 725.6289 754.5020 756.2024 800.3568 856.1719 861.4122 898.9765 919.3190 925.7154 928.7213 941.0222 959.8223 979.7117 983.5007 985.8542 986.7150 998.2643 1000.6521 1017.1209 1018.8235 1022.8671 1023.4916 1066.4815 1074.8982 1077.1519 1080.2879 1168.9779 1171.6485 1182.0543 1190.2907 1205.1655 1225.2875 1234.7751 1299.3511 1307.2753 1365.0541 1367.0626 1369.3208 1372.9282 1375.2286 1398.2819 1420.5603 1423.2967 1450.4451 1459.6505 1461.1332 1462.5366 1466.0751 1473.3783 1479.9326 1492.6618 1579.5278 1582.2576 1591.0352 1593.8212 2966.1466 2971.9104 2980.0859 3063.9778 3066.5787 3072.2065 3078.5817 3083.9002 3090.0976 3113.3846 3116.3711 3119.0711 3122.4787 3131.4403 3134.2523 3141.3628 3144.9114 3158.9613 3161.0978 3461.0011
redmass: 3.6409 3.5452 3.1033 3.9305 4.5518 4.3798 3.5596 3.7202 2.8275 1.2362 3.6155 3.5424 1.1454 3.4139 1.0630 3.0710 2.2150 2.5619 3.8838 2.8325 3.3463 4.3886 1.7989 3.4524 2.8094 3.3619 4.0626 6.4522 6.4189 6.6578 6.7941 2.0574 2.0408 2.6380 1.6420 1.8299 3.1547 1.2464 1.2491 1.7027 1.6348 1.3766 1.3651 1.2140 2.5978 1.4044 1.4797 5.7886 4.7567 1.3164 1.3048 3.4693 3.0789 1.3954 1.4016 1.8701 1.7524 1.9668 2.3894 1.0604 1.0545 1.1260 1.1207 2.1694 2.7588 2.9697 1.3586 1.3421 1.3330 1.9916 1.3508 2.4640 3.7311 1.2383 2.1254 2.1359 1.0517 1.0535 2.0458 2.0234 1.0472 1.0609 1.0711 1.0557 5.8970 6.0725 5.8887 5.9181 1.0344 1.0358 1.0354 1.0988 1.0998 1.0997 1.0990 1.1004 1.0996 1.0861 1.0862 1.0864 1.0865 1.0910 1.0914 1.0958 1.0960 1.1014 1.1016 1.0751
irintensity: 0.1790 0.0637 0.0381 0.1116 0.1550 0.3511 0.1864 2.8382 1.8655 0.1530 1.6688 0.7984 0.0915 1.3655 0.5486 0.8909 1.4715 16.8155 3.0330 0.7407 1.3752 3.7976 41.8257 27.4902 5.9048 51.3639 24.9055 0.2896 0.1751 0.9034 0.6641 37.4434 38.9833 51.9666 42.3269 39.2609 33.8605 0.1729 0.0841 2.8233 1.4774 0.9588 1.4222 0.1279 29.4540 0.1406 0.0265 0.9537 1.1134 0.0117 0.2832 6.7499 6.8517 0.4016 0.2660 10.3155 5.3754 6.4077 7.8832 0.9540 0.0644 5.2712 3.3445 35.2790 82.2842 67.9487 4.2332 3.2106 25.4683 6.7979 26.3460 14.6014 3.6301 13.2609 14.9749 8.6734 0.7824 0.2286 17.1604 18.3048 0.5674 11.5897 9.3394 18.0270 0.9998 0.0455 6.7134 8.9177 24.8378 33.2853 18.5858 5.8190 29.4470 49.6797 66.8812 7.9729 79.1815 4.2718 3.0846 0.7707 0.0200 2.6208 7.7243 37.2176 33.1469 48.4353 33.9842 1.6639
temp: 298.150 k
press: 1.00000 atm
elementType: 15 7 6 6 6 6 6 6 6 6 6 6 6 6 6 6 6 6 1 1 1 1 1 1 1 1 1 1 1 1 1 1 1 1 1 1 1 1
symmnumber: 1
zpe: 826386.7 jmol-1
zpe.correction: 0.314754 hartree
zpe.thermalcorrener: 0.333424 hartree
zpe.thermalcorrenthalpy: 0.334368 hartree
zpe.thermalcorrgfe: 0.265816 hartree
zpe.sumelectzpe: -1016.359241 hartree
zpe.sumelectthermal: -1016.340572 hartree
zpe.sumelectthermalent: -1016.339628 hartree
zpe.sumelectthermalfe: -1016.408179 hartree
dipole: 0.8104 0.6258 1.2997
dipole: 1.6546
quadrupole: -107.0024 -108.4389 -115.3068
quadrupole: -0.3811 -2.6026 -2.2706
quadrupole: 3.2470 1.8105 -5.0575 -0.3811 -2.6026 -2.2706
hfenergy: -1016.6739955 hartree
pointgroup: C01 [X(C16H20N1P1)]
dipole: 0.4006848 0.1770004 -0.4815178 debye
polarizability: 233.4201645|10.3929933|224.4178495|21.2080281|11.188297|149.3020062 unknown
InChI: InChI=1S/C16H20NP/c1-16(2,3)17-18(14-10-6-4-7-11-14)15-12-8-5-9-13-15/h4-13,17H,1-3H3
charge 0 multiplicity 1
38 atoms
P  -0.340977 0.406858 0.896159
N  -0.73706 1.52725 -0.440001
C  -1.088788 2.960948 -0.19234
C  -1.483671 3.556462 -1.567473
C  -2.295853 3.032236 0.774099
C  0.111375 3.756776 0.399283
C  -1.260123 -1.1501 0.330227
C  1.44136 -0.079072 0.441752
C  -0.99176 -2.387715 0.971178
C  1.761715 -1.000266 -0.588362
C  -2.279019 -1.084691 -0.6492
C  2.494808 0.558432 1.14735
C  -1.724248 -3.545123 0.624652
C  3.111575 -1.269345 -0.913522
C  -3.014131 -2.243257 -0.994725
C  3.844482 0.289662 0.82387
C  -2.739136 -3.476432 -0.360228
C  4.155719 -0.624423 -0.209927
H  -0.223453 1.377832 -1.317828
H  -2.340202 3.005738 -1.99528
H  -1.765219 4.619596 -1.461786
H  -0.63962 3.500091 -2.282397
H  -2.045226 2.58184 1.751651
H  -3.157209 2.484013 0.352872
H  -2.591303 4.083772 0.944501
H  0.986785 3.70031 -0.274222
H  -0.147888 4.822198 0.547002
H  0.402278 3.334508 1.379234
H  -0.206621 -2.451797 1.735042
H  0.958623 -1.517028 -1.126446
H  -2.480586 -0.11999 -1.129535
H  2.256746 1.263646 1.953383
H  -1.505057 -4.496657 1.122655
H  3.346505 -1.98317 -1.711508
H  -3.800478 -2.181204 -1.756225
H  4.648068 0.786691 1.379243
H  -3.309568 -4.373752 -0.626236
H  5.201358 -0.836638 -0.460615
