program: Gaussian 09
title: 000266992
version: EM64L-G09RevD.01
frameworkgroup: C1[X(C9H14O3)]
method: RPBEPBE
basis: SDD
operation: Freq
keyword: #pfreq=noraman
keyword: PBEPBE/SDD
title: #p freq=noraman PBEPBE/SDD
converged: YES YES NO NO
title: Mulliken charges:
elementType: O O O C C C C C C C C C H H H H H H H H H H H H H H
charge: -0.274193 -0.215750 -0.251095 -0.385160 -0.386760 -0.549414 -0.505430 -0.397588 -0.485110 0.270043 -0.275661 0.250700 0.198100 0.224958 0.259211 0.198995 0.248659 0.239320 0.236701 0.213060 0.248908 0.213205 0.232063 0.231490 0.223836 0.236911
chargesum: 0.00000
title: Mulliken charges with hydrogens summed into heavy atoms:
elementType: O O O C C C C C C C C C
charge: -0.274193 -0.215750 -0.251095 0.037898 0.071446 -0.061435 -0.055669 0.064524 -0.021556 0.270043 0.185086 0.250700
polarizability: 1.13628493e+02 -3.74379057e+00 9.83709226e+01 1.86146449e+00 4.23283486e+00 8.95426188e+01
1716.lowfreq: -23.4841 -12.3629 -10.4572 -0.0007 -0.0004 0.0004 31.6996 69.3694 91.0774
frequency: 27.7573 69.2895 91.0460 164.0320 198.3497 212.5852 230.9601 265.0718 296.9960 318.4098 363.7821 395.4510 446.5388 490.9234 541.0053 559.0535 587.1595 622.5135 734.7871 758.3058 800.1645 807.9540 869.8813 874.2307 896.2703 918.9906 940.6418 963.3170 1014.5890 1031.1194 1065.6088 1077.9709 1089.4302 1120.1457 1133.8218 1165.0568 1195.3147 1200.9148 1215.6860 1231.9524 1250.4722 1271.7280 1320.6422 1325.3006 1342.5610 1347.8396 1352.8565 1355.3553 1362.7592 1443.3922 1447.6814 1453.0950 1453.9221 1459.1849 1472.7136 1475.7638 1623.3858 1635.6653 2958.7053 2986.2248 2990.5733 2991.9584 3000.4502 3006.1563 3014.4476 3031.1931 3053.5334 3056.0802 3062.1868 3065.7869 3082.6837 3087.2872
redmass: 4.1777 4.2795 6.9812 4.6121 3.4802 2.5198 5.6557 2.2692 2.7394 2.0120 2.4202 2.5525 2.5807 2.6800 2.5033 3.6576 2.9132 3.3219 1.9634 3.5552 2.6759 2.3932 2.3462 1.7848 2.0551 2.2465 2.2383 2.5953 2.6319 1.8793 2.3128 2.1459 1.9059 2.2010 1.5331 1.4561 1.4566 1.5899 1.4453 1.2488 1.1700 1.2890 1.3466 1.3369 1.4814 1.4369 1.4142 1.3846 1.4021 1.0832 1.0893 1.0845 1.0996 1.0853 1.0805 1.0876 7.9629 9.9563 1.0661 1.0634 1.0633 1.0594 1.0602 1.0659 1.0592 1.0931 1.0992 1.0997 1.0983 1.1022 1.0970 1.1074
irintensity: 1.6223 2.1633 3.8793 7.6255 4.7016 1.5701 7.5766 1.7129 3.0823 7.7106 2.1391 5.8740 0.3164 6.1244 0.4897 2.5674 4.1653 4.4208 4.3892 9.3796 6.9242 4.7965 2.5603 2.6309 12.0865 17.9049 13.2423 33.6969 59.6121 36.6298 15.7023 1.3122 51.2855 11.7155 52.6443 49.4063 56.6181 16.9740 25.3963 6.8384 9.7902 35.0582 20.8857 2.1043 19.3595 2.1071 2.2856 1.8980 18.0834 15.7564 12.3732 11.2366 28.1379 18.7386 6.4809 29.4357 57.1101 206.5289 15.9749 21.6245 27.7828 22.4885 22.8147 50.9931 39.7170 2.6625 20.9911 12.8522 2.1164 29.8855 29.3272 20.8381
temp: 298.150 k
press: 1.00000 atm
elementType: 8 8 8 6 6 6 6 6 6 6 6 6 1 1 1 1 1 1 1 1 1 1 1 1 1 1
symmnumber: 1
zpe: 572823.8 jmol-1
zpe.correction: 0.218177 hartree
zpe.thermalcorrener: 0.229891 hartree
zpe.thermalcorrenthalpy: 0.230836 hartree
zpe.thermalcorrgfe: 0.180078 hartree
zpe.sumelectzpe: -576.085682 hartree
zpe.sumelectthermal: -576.073968 hartree
zpe.sumelectthermalent: -576.073024 hartree
zpe.sumelectthermalfe: -576.123781 hartree
dipole: -0.5300 0.2510 0.6998
dipole: 0.9130
quadrupole: -61.4572 -80.6061 -74.6843
quadrupole: -5.2239 -3.4483 -10.4654
quadrupole: 10.7920 -8.3569 -2.4351 -5.2239 -3.4483 -10.4654
hfenergy: -576.3038595 hartree
pointgroup: C01 [X(C9H14O3)]
dipole: -0.113704 0.1980644 0.2772544 debye
dipolederiv: -1.1942373 0.3242058 -0.2769737 0.4180843 -0.6402639 0.1002379 -0.3405424 0.0740621 -0.5360038 -0.5465718 0.000577 -0.1605672 0.0078797 -0.6075376 -0.1446799 -0.1833838 -0.2183868 -0.6097538 -0.5889837 0.0761263 -0.1207682 -0.1319746 -0.6094377 -0.2775804 -0.3853785 -0.179981 -0.7000314 0.1161027 -0.0339573 0.0079231 -0.0723095 0.0944473 -0.0350507 0.0116379 -0.0123133 0.0900978 0.057389 0.0722023 0.0037464 0.037398 0.1545959 0.0197342 -0.0317495 0.0515257 0.0650243 -0.1096635 0.1816264 -0.0952041 0.2115638 -0.1019666 0.101213 -0.1566554 0.0949085 -0.1445512 -0.0414885 0.2006443 0.0656065 0.139261 -0.384759 -0.0043941 -0.0121268 0.0661193 0.0488874 0.0205101 0.013467 -0.0059461 0.024619 0.145832 0.0102375 0.0353169 -0.1193824 0.1001815 -0.0307773 0.0821274 0.0454131 0.0658197 -0.1657679 -0.0948995 0.0684433 -0.1725993 0.0087143 0.6346647 -0.299744 0.2674966 -0.2557525 0.8848241 0.1288499 0.3282149 0.2222759 0.5562399 0.5065683 -0.1800736 0.0033363 -0.2827467 0.4320305 -0.0904825 -0.1443214 0.0560503 0.2096202 1.1839443 -0.4319994 0.4093396 -0.2399682 0.8136921 0.2658096 0.7832064 0.1517375 0.919256 -0.0642399 0.1214011 -0.0849602 0.0721465 0.0182396 0.061082 -0.0594945 0.0913934 -0.0535631 0.0188661 -0.1321023 -0.0157721 -0.0734054 -0.0591266 -0.0448259 0.0019478 -0.0762754 0.0366759 0.0222721 -0.0127782 -0.0992811 -0.0101276 0.0578092 0.0711384 -0.0674524 0.0608905 0.005264 -0.0477422 0.0850335 0.1055913 0.0852352 -0.0905029 -0.0937333 0.098441 -0.0876365 0.0218029 0.0110302 -0.0150736 -0.0710239 -0.0256341 -0.0471679 -0.104349 -0.0252091 -0.094872 0.056027 -0.01417 -0.0534625 0.0865751 -0.0447519 0.0452261 0.0815202 0.0776149 0.0572276 -0.0028637 -0.1095202 -0.0293509 0.0438578 -0.0421785 0.0568118 0.0030687 0.015055 -0.0159936 0.0833045 0.0653426 -0.0193469 -0.109114 -0.0043969 0.0272962 -0.0318618 -0.0567598 -0.0304018 -0.1025223 0.0596937 -0.0284822 -0.0149647 -0.0717014 0.0757933 -0.0548466 -0.0478705 0.0002115 -0.0766984 -0.0415803 0.1117844 0.0170638 0.1072761 -0.1150193 -0.0113457 0.0470087 -0.0188485 0.0856073 0.0230836 -0.0309922 0.0737918 -0.0449645 0.0250734 0.0468133 0.1087018 0.0566508 -0.0000971 0.0195117 0.0246603 -0.0702716 0.0576862 0.0188455 0.0113603 -0.1298896 0.022263 -0.0220425 0.0057961 -0.0158664 0.0306099 0.0322326 -0.0733499 0.0974618 0.0482677 0.1367704 -0.0106124 0.0441995 -0.0106262 -0.0355047 0.0407098 0.0443824 -0.0104775 0.0169772 -0.1153959 -0.0279634 unknown
polarizability: 105.1405832|-8.4765184|106.8405831|3.8366089|2.5696131|89.5608677 unknown
InChI: InChI=1S/C9H14O3/c10-8-4-1-2-6-9(11)12-7-3-5-8/h1-7H2
charge 0 multiplicity 1
26 atoms
O  0.480149 1.099293 -0.732913
O  -1.91657 -1.305579 -0.829507
O  1.850137 1.470194 1.124443
C  0.570004 -2.329235 0.279903
C  1.36649 -1.61594 -0.842129
C  -0.396926 -1.422314 1.07852
C  -2.082806 0.567798 0.708167
C  -1.860815 1.707105 -0.326422
C  2.282261 -0.454253 -0.373027
C  -1.485346 -0.764068 0.224679
C  -0.418736 2.22906 -0.356785
C  1.553836 0.789395 0.115251
H  1.273059 -2.802936 0.994172
H  -0.018198 -3.140491 -0.187546
H  0.666914 -1.240025 -1.608202
H  2.008439 -2.370196 -1.337307
H  0.14552 -0.650126 1.654641
H  -0.922707 -2.038019 1.841344
H  -3.17381 0.415792 0.820607
H  -1.672467 0.854183 1.693818
H  -2.151961 1.334361 -1.325752
H  -2.522459 2.562189 -0.085502
H  2.920361 -0.141386 -1.223821
H  2.959065 -0.772553 0.439803
H  -0.287312 2.999196 -1.136628
H  -0.092222 2.630357 0.619896
