program: Gaussian 09
title: 000266990
version: EM64L-G09RevD.01
frameworkgroup: C1[X(C13H9BrO2)]
method: RPBEPBE
basis: SDD
operation: Freq
keyword: #p
keyword: freq=noraman
keyword: PBEPBE/SDD
title: #p freq=noraman PBEPBE/SDD
converged: YES YES NO NO
title: Mulliken charges:
elementType: Br O O C C C C C C C C C C C C C H H H H H H H H H
charge: 0.022577 -0.418888 -0.219363 0.177792 0.344048 0.017944 0.193796 -0.325425 -0.328941 -0.354747 -0.342604 -0.223439 -0.185970 -0.243183 -0.233874 -0.228882 0.274965 0.241419 0.270873 0.246853 0.257426 0.229278 0.231989 0.231558 0.364797
chargesum: 0.00000
title: Mulliken charges with hydrogens summed into heavy atoms:
elementType: Br O O C C C C C C C C C C C C C
charge: 0.022577 -0.054091 -0.219363 0.177792 0.344048 0.017944 0.193796 -0.050460 -0.087521 -0.083874 -0.095751 0.033987 -0.185970 -0.013905 -0.001884 0.002675
polarizability: 2.67659130e+02 -2.45936410e+00 1.47350669e+02 1.13941287e+01 -6.96238360e-01 8.75282253e+01
1716.lowfreq: -12.1317 -3.0117 -0.0006 0.0002 0.0003 2.4827 29.1628 46.5605 64.7895
frequency: 29.0564 46.5456 64.7827 101.9966 153.3863 165.0058 186.5347 208.3176 218.7329 263.4110 329.8011 353.9700 374.2992 403.3544 408.9951 440.6714 484.9609 533.9473 553.3798 591.6785 613.4426 647.8785 676.1038 696.6458 700.5876 741.9233 798.5535 829.1128 830.6845 847.1924 858.4630 912.7603 945.9827 963.9601 987.1639 990.2999 1003.5279 1024.8466 1066.7603 1084.1099 1089.6179 1151.9518 1155.2347 1173.5727 1187.3369 1236.3542 1273.2404 1289.7093 1317.8210 1378.6929 1385.6487 1388.1134 1435.0153 1472.7497 1478.2229 1534.9309 1582.3619 1587.1941 1594.0934 1609.3375 3126.9667 3137.5320 3142.4266 3148.8153 3157.9596 3158.7453 3169.0305 3183.7701 3577.8325
redmass: 7.7099 5.0700 5.0707 7.1017 7.4107 6.5248 6.2444 9.0769 6.0625 4.8530 2.1125 1.9776 5.3278 3.0701 4.0952 3.4031 4.2891 8.0609 6.4312 4.4866 6.4499 6.8146 4.4041 2.3871 2.8769 2.5038 1.9302 1.8838 1.5684 5.8837 1.2623 5.8342 1.4791 1.3948 1.3919 6.1339 1.3375 2.2016 2.3559 1.6388 1.9824 1.8929 1.4790 1.0580 1.1332 2.1785 2.3710 1.7344 1.3427 7.2911 4.9314 7.0980 2.2846 2.5415 2.3448 10.3409 7.2765 6.4203 6.9691 6.0892 1.0850 1.0881 1.0924 1.0925 1.0893 1.0963 1.1011 1.0965 1.0662
irintensity: 0.1969 0.8906 1.3249 2.0902 1.1775 2.4632 0.0948 1.4258 0.5749 7.1206 44.0114 68.4979 19.8152 0.3655 4.2477 11.3408 10.1901 6.4596 9.4324 6.6866 0.4858 9.9909 17.5591 31.3263 37.5987 31.6283 16.7811 31.4637 32.4155 68.3866 0.7976 124.2062 6.7708 4.1596 1.6800 1.6086 1.1102 3.9493 61.2045 4.3547 53.8293 69.2022 9.9671 0.1502 16.4088 38.3401 95.3267 201.8474 8.1110 13.3007 58.9308 46.1924 20.9662 24.6493 0.5051 150.2956 47.3031 139.8372 140.5844 13.3641 0.1446 5.6572 3.8195 23.1961 0.1668 22.4375 22.7124 1.7203 43.0367
temp: 298.150 k
press: 1.00000 atm
elementType: 35 8 8 6 6 6 6 6 6 6 6 6 6 6 6 6 1 1 1 1 1 1 1 1 1
symmnumber: 1
zpe: 474062.8 jmol-1
zpe.correction: 0.180561 hartree
zpe.thermalcorrener: 0.194411 hartree
zpe.thermalcorrenthalpy: 0.195356 hartree
zpe.thermalcorrgfe: 0.137944 hartree
zpe.sumelectzpe: -663.575511 hartree
zpe.sumelectthermal: -663.561661 hartree
zpe.sumelectthermalent: -663.560716 hartree
zpe.sumelectthermalfe: -663.618128 hartree
dipole: 0.2973 -3.8776 -0.0181
dipole: 3.8890
quadrupole: -95.6689 -99.3285 -100.0563
quadrupole: -7.4483 -0.9826 -5.1630
quadrupole: 2.6823 -0.9773 -1.7051 -7.4483 -0.9826 -5.1630
hfenergy: -663.7560721 hartree
pointgroup: C01 [X(C13H9Br1O2)]
dipole: -0.1810038 0.937057 1.1959293 debye
dipolederiv: -0.7878542 -0.1616917 -0.0807984 -0.2085773 -0.0733696 -0.0270416 -0.1473246 -0.0340743 -0.079877 -0.5397507 -0.0265951 0.5880811 0.0170484 -0.3455102 0.1398791 0.4924612 0.1508363 -0.8718184 -0.8648857 0.0072934 -0.0537127 0.1338022 -0.6947605 -0.3218702 -0.099684 -0.3512289 -0.6090561 -0.8626019 -0.1111197 -0.1533971 -0.1083742 -0.1031516 -0.0709896 0.19526 -0.0109358 -0.2528157 -0.7086476 0.2118045 0.1732641 0.1846169 -0.1390678 -0.1256637 0.203202 -0.1191153 -0.096696 2.2072444 -0.1374265 0.0140062 -0.2190136 0.6835685 0.4466911 -0.0285991 0.4544847 0.5252773 0.6421299 0.0996675 -0.5709322 0.2423806 0.1288052 -0.0887665 -0.2337011 -0.0809373 0.8812568 0.4493401 0.1134248 0.0956619 -0.0376838 -0.0804198 0.0468796 -0.3383156 -0.0311512 0.074797 0.084658 0.076686 -0.0004945 -0.1275318 -0.0002871 0.0502902 -0.1425558 0.0646869 -0.0408762 0.1284631 -0.1223165 -0.0867141 0.1220089 0.0450803 0.0465962 0.0833892 0.0772146 -0.0789562 -0.6927696 -0.0937904 0.3225218 -0.1276803 -0.168519 0.0834741 -0.0336553 0.0002673 -0.1239456 -0.6318469 -0.1190187 -0.2490871 -0.1465816 -0.1632472 -0.0633084 -0.2437561 -0.0410766 -0.1698538 1.3652934 0.3383292 0.0934874 0.4112931 0.0014263 0.0719144 0.3299143 0.1076734 0.3476547 -0.279352 0.0067384 0.011964 -0.0386415 0.1082935 0.1037166 0.0103547 0.1046777 -0.1149996 0.0474331 0.1561773 0.0127236 0.2027269 -0.1306595 -0.0187902 0.0389416 -0.0207719 -0.1686182 0.0844305 -0.0285636 -0.0652952 -0.0320968 0.0373886 0.077726 -0.0570372 0.0722306 -0.0942563 0.0862428 -0.030567 -0.0592198 0.0031389 0.138108 -0.0410299 -0.028048 -0.0102975 0.0182831 -0.0279429 -0.0949849 0.0023162 -0.1313226 0.0668969 -0.0117487 -0.0044347 -0.0255224 0.1025517 0.1338398 0.0137501 0.0174761 -0.0226055 0.0006567 -0.0492019 -0.024661 -0.068706 0.1268254 0.0763308 -0.0208807 -0.0081445 -0.039667 0.1624151 -0.020345 -0.0255091 -0.0252955 -0.0588986 0.0181567 -0.0220259 0.0708731 -0.0238865 0.1670225 0.0049204 0.0689577 -0.0024024 0.0269462 0.0783016 -0.0187703 0.00668 0.0150408 -0.0875188 -0.0920948 0.0314454 -0.0933141 0.1153775 -0.1025441 -0.0842793 0.0139047 -0.0953429 0.0479171 -0.0247674 0.0102041 -0.0237173 0.1457523 -0.0721438 0.0745229 0.0728189 0.0832734 0.0589834 -0.0532044 0.0759193 -0.0531175 0.119896 0.1684752 -0.0263638 -0.1679833 -0.0563244 0.339949 -0.0632656 -0.1327676 -0.0404077 0.2760495 unknown
polarizability: 266.2033426|17.1267452|111.1395608|-10.139742|28.3303638|125.1951202 unknown
InChI: InChI=1S/C13H9BrO2/c14-10-6-7-11(12(15)8-10)13(16)9-4-2-1-3-5-9/h1-8,15H
charge 0 multiplicity 1
25 atoms
Br 5.40044 0.825121 0.266365
O  0.396347 -0.27423 1.841216
O  -0.715841 -1.741918 -1.743671
C  0.830771 -0.375534 -0.536654
C  -1.766743 -0.147981 -0.282377
C  -0.570073 -0.820259 -0.880062
C  1.299131 -0.117189 0.782744
C  1.771411 -0.311902 -1.596602
C  -1.709244 1.168659 0.245024
C  -3.013413 -0.828766 -0.323346
C  2.651579 0.235817 1.020253
C  3.118041 0.047688 -1.389546
C  3.535397 0.323577 -0.070756
C  -2.879364 1.794076 0.723464
C  -4.178291 -0.210924 0.171775
C  -4.114275 1.10389 0.694773
H  1.4206 -0.559367 -2.603489
H  -0.755151 1.705914 0.263396
H  -3.04214 -1.836198 -0.75147
H  3.006548 0.426382 2.039206
H  3.818818 0.107051 -2.22545
H  -2.832242 2.81563 1.116334
H  -5.134374 -0.745046 0.148032
H  -5.021605 1.58837 1.073152
H  0.832172 -0.11536 2.715289
