program: Gaussian 09
title: 000266984
version: EM64L-G09RevD.01
frameworkgroup: C1[X(C13H9BrO3)]
method: RPBEPBE
basis: SDD
operation: Freq
keyword: #p
keyword: freq=noraman
keyword: PBEPBE/SDD
title: #p freq=noraman PBEPBE/SDD
converged: YES YES NO NO
title: Mulliken charges:
elementType: Br O O O C C C C C C C C C C C C C H H H H H H H H H
charge: 0.011568 -0.300348 -0.398918 -0.334917 0.083170 0.160156 -0.249905 0.387942 0.237257 -0.328098 -0.229319 -0.146524 -0.314860 -0.399872 -0.208534 -0.194120 -0.242597 0.281265 0.266292 0.256379 0.309704 0.257231 0.233220 0.235120 0.234194 0.394516
chargesum: 0.00000
title: Mulliken charges with hydrogens summed into heavy atoms:
elementType: Br O O O C C C C C C C C C C C C C
charge: 0.011568 -0.300348 -0.004402 -0.334917 0.083170 0.160156 0.031360 0.387942 0.237257 -0.061806 -0.229319 0.109854 -0.005156 -0.142642 0.024686 0.041000 -0.008403
polarizability: 2.69603072e+02 -6.51280163e+00 2.00725765e+02 -8.97510434e-02 -1.33049604e-01 6.01552472e+01
1716.lowfreq: -5.3535 -0.0004 0.0004 0.0005 2.2364 6.5949 22.0535 43.8162 56.0370
frequency: 22.0064 43.7996 56.0368 81.7603 130.1816 150.3154 151.8847 234.5802 250.1710 258.8505 281.5683 316.7924 374.9509 409.6650 431.2240 435.1486 469.4859 500.3728 521.6702 576.1277 605.9065 612.4339 664.4814 688.7222 692.4100 746.3661 762.9717 765.9243 788.9962 824.9748 843.7552 850.5055 856.8433 909.1529 927.3128 965.4795 979.8298 987.0073 998.5823 1019.9638 1047.0826 1066.5209 1081.8003 1131.3771 1157.3162 1172.0875 1191.8919 1210.8918 1250.2725 1266.2168 1310.8534 1356.7885 1384.4392 1394.6680 1398.4607 1443.2978 1452.9697 1469.2692 1549.2178 1567.0561 1591.0875 1607.8647 1634.1484 3041.4286 3136.4215 3147.4850 3162.6182 3163.3362 3175.4666 3184.0088 3187.7952 3215.9671
redmass: 3.9979 6.0043 9.0510 8.6066 8.6137 5.8740 7.5872 7.5387 5.6363 8.1718 7.5481 6.9818 8.6999 2.9397 3.6527 9.8745 5.0423 3.1511 3.5249 7.0427 6.9325 7.6236 6.1719 8.5684 2.3249 4.0477 7.7237 1.4989 7.2800 1.4757 1.2289 1.1279 7.7052 1.4352 1.3903 1.3424 1.3606 6.2777 1.3059 2.5415 3.1510 2.5292 1.5111 1.5766 2.2433 1.0665 1.4448 1.6250 2.1909 2.5319 1.3406 2.4523 9.5305 3.5714 6.7357 2.2504 2.6708 2.2696 6.3358 4.8145 6.4894 6.5060 5.3034 1.0678 1.0856 1.0903 1.0950 1.0889 1.1001 1.0965 1.0935 1.0945
irintensity: 0.0346 0.6674 0.1285 0.1353 0.4912 0.0040 1.1118 0.5772 0.0070 1.7836 3.5340 1.5502 22.0338 0.0498 0.2034 0.0696 8.6403 14.1694 20.9755 17.9892 11.8264 18.5576 0.0527 31.1272 28.2281 0.8734 0.9259 88.7746 1.0628 132.6871 6.4046 63.9859 28.2213 7.7197 15.9767 0.5008 0.2819 7.9314 2.1300 4.0312 96.5746 17.1690 12.8052 0.3443 232.4363 6.0496 131.2702 353.0720 253.1051 302.2370 11.3769 242.4248 30.4737 62.3254 37.3354 0.8291 186.4347 85.0512 93.1664 47.2248 20.9131 10.1095 72.1345 328.7851 0.2634 13.5218 24.8499 0.9364 11.2703 2.3602 2.8873 5.3788
temp: 298.150 k
press: 1.00000 atm
elementType: 35 8 8 8 6 6 6 6 6 6 6 6 6 6 6 6 6 1 1 1 1 1 1 1 1 1
symmnumber: 1
zpe: 486511.2 jmol-1
zpe.correction: 0.185302 hartree
zpe.thermalcorrener: 0.199658 hartree
zpe.thermalcorrenthalpy: 0.200603 hartree
zpe.thermalcorrgfe: 0.141274 hartree
zpe.sumelectzpe: -738.739597 hartree
zpe.sumelectthermal: -738.725241 hartree
zpe.sumelectthermalent: -738.724297 hartree
zpe.sumelectthermalfe: -738.783626 hartree
dipole: 1.8065 -1.2875 0.0077
dipole: 2.2183
quadrupole: -89.0709 -107.2059 -112.4378
quadrupole: -8.1935 -0.0113 -0.0690
quadrupole: 13.8340 -4.3010 -9.5330 -8.1935 -0.0113 -0.0690
hfenergy: -738.9248997 hartree
pointgroup: C01 [X(C13H9Br1O3)]
dipole: 0.8172379 0.2354196 0.1959845 debye
dipolederiv: -0.1347169 0.0943001 0.1174069 0.1960953 -0.2687231 -0.2901695 0.2349105 -0.2816663 -0.3762964 -2.2724848 -0.3138721 -0.1797371 -0.8128092 -0.3799043 -0.1794155 -0.7599885 -0.2237449 -0.355601 -0.4986987 0.1979605 0.2379925 0.0117349 -0.7746372 -0.4437268 0.0224041 -0.4595566 -0.9223123 -0.9087668 0.1148518 0.1804217 -0.0898117 -0.614506 -0.3111645 -0.0570269 -0.3294372 -0.7107068 -1.1605498 -0.028099 0.058883 0.1979315 -0.1470205 -0.1107198 0.3196652 -0.0925329 -0.1980559 0.3068824 -0.3139399 -0.3780201 0.0778174 0.5526641 0.4978087 0.0735002 0.5308249 0.7213331 0.2731589 0.0729226 0.0597167 -0.2102612 -0.1202232 -0.0887864 -0.2659602 -0.112197 -0.1353904 1.5426453 0.1605826 0.057012 0.1200742 0.1249648 0.0241988 0.008741 0.0214106 0.1159004 2.7347493 0.0538427 -0.1440552 0.7170972 0.6995823 0.433291 0.6244447 0.4912321 0.7814332 0.0477447 0.2519511 0.2730578 0.0369853 -0.1900998 -0.0224486 0.0252795 -0.0401081 -0.2212106 -0.3990089 -0.29681 -0.3230782 -0.4348747 0.3353864 0.612812 -0.483565 0.6007209 0.5694104 0.1460691 0.0938964 0.0923873 0.2435887 -0.0323457 0.0072134 0.2650108 0.0199036 -0.0553447 -0.3174884 0.012788 0.029292 0.0204686 -0.1215026 0.0223243 0.038478 0.0238463 -0.1196107 -0.2583861 -0.0512669 -0.0514669 -0.072175 -0.1145796 0.0667622 -0.0728849 0.0650377 -0.0874694 0.0081494 -0.0432605 -0.0634262 -0.0835063 -0.0382137 0.1312356 -0.108337 0.1282143 0.0067342 0.0308731 0.0432556 0.0331328 0.0780876 -0.0220626 0.1326338 0.0710194 0.1354231 0.0017536 0.0295406 0.0088304 -0.0076716 0.022954 -0.1343562 0.0298896 0.0093712 0.0309198 -0.1279118 0.1151031 -0.0494497 -0.0542499 -0.0456928 0.1085493 -0.047539 -0.0500106 -0.0470311 0.1029915 0.024669 -0.0300488 -0.0226784 -0.0492669 0.0976423 -0.0849881 -0.044992 -0.0865024 0.0782551 -0.0359227 0.0161878 0.0341561 0.025994 0.1351278 -0.0252482 0.0452932 -0.0242521 0.1234732 0.1961851 -0.0318943 -0.0364921 -0.0319814 0.1273995 -0.0633578 -0.0359252 -0.0638661 0.1168405 0.0605575 0.0530646 0.0705958 0.0569971 0.1089848 -0.0789687 0.0753893 -0.0786864 0.0786286 0.0000828 0.0435972 0.0631301 0.0624919 0.0725271 -0.1011081 0.0846229 -0.0995134 0.0367121 0.0249535 -0.0548826 -0.0501845 -0.0704596 0.0546796 -0.1126971 -0.0677423 -0.1140366 0.0366534 -0.130746 -0.0201128 0.0036945 -0.0220411 0.1337614 -0.0362977 0.0018509 -0.0364135 0.1261416 0.5754052 0.0156052 0.0001808 0.0545625 0.4069052 0.0384664 0.0464517 0.0420114 0.413649 unknown
polarizability: 267.5122959|0.9993844|121.2020868|-16.5208796|69.9317122|141.7697022 unknown
InChI: InChI=1S/C13H9BrO3/c14-9-6-7-12(15)11(8-9)13(16)17-10-4-2-1-3-5-10/h1-8,15H
charge 0 multiplicity 1
26 atoms
Br -3.743782 1.927285 2.646645
O  0.817175 0.1775 0.254711
O  -2.18945 -1.915343 -1.915049
O  0.290851 -1.343906 -1.456137
C  -1.475109 -0.338099 -0.150873
C  -2.486132 -1.047558 -0.888629
C  -1.858291 0.544724 0.899138
C  2.246124 0.181928 0.130683
C  -0.066859 -0.555659 -0.517936
C  -3.852803 -0.856279 -0.558188
C  -3.213183 0.711613 1.200509
C  -4.218491 0.01632 0.478545
C  2.993895 -0.578552 -0.797784
C  2.869475 1.047955 1.056189
C  4.402734 -0.450547 -0.778955
C  4.274826 1.159415 1.05608
C  5.047596 0.409397 0.137536
H  -1.080921 1.077049 1.451185
H  -4.606804 -1.403569 -1.129938
H  -5.273992 0.158949 0.727751
H  2.496013 -1.241187 -1.505173
H  2.249749 1.616574 1.75583
H  4.994674 -1.033721 -1.492619
H  4.763425 1.829822 1.770848
H  6.139182 0.495668 0.137633
H  -1.176201 -1.942579 -2.028704
