program: Gaussian 09
title: 000266981
version: EM64L-G09RevD.01
frameworkgroup: C1[X(C10H10N2O2)]
method: RPBEPBE
basis: SDD
operation: Freq
keyword: #p
keyword: freq=noraman
keyword: PBEPBE/SDD
title: #p freq=noraman PBEPBE/SDD
converged: YES YES NO NO
title: Mulliken charges:
elementType: O O N N C C C C C C C C C C H H H H H H H H H H
charge: -0.445469 -0.244940 -0.235208 -0.001396 0.049475 0.259037 -0.493699 0.116089 -0.069369 -0.126574 -0.672550 -0.282536 -0.240215 -0.173310 0.271256 0.159871 0.291827 0.222767 0.267798 0.203358 0.275920 0.236485 0.246896 0.384486
chargesum: 0.00000
title: Mulliken charges with hydrogens summed into heavy atoms:
elementType: O O N N C C C C C C C C C C
charge: -0.060984 -0.244940 -0.235208 -0.001396 0.049475 0.259037 -0.062571 0.116089 -0.069369 0.165253 0.021374 -0.006615 -0.003730 0.073586
polarizability: 2.08415693e+02 -1.43416084e+01 1.34771184e+02 7.05769471e+00 1.06257241e+00 6.21940616e+01
1716.lowfreq: -10.4597 -0.0005 -0.0005 0.0006 6.0997 13.9178 58.2428 63.2378 92.2176
frequency: 57.9049 63.1988 92.2011 160.4045 183.0229 208.2108 265.0570 284.8495 330.5245 348.4684 372.3476 391.6189 425.9375 450.6687 488.6724 532.5786 543.1965 603.2567 624.8373 646.9700 662.1929 719.5366 756.6355 762.0172 768.4428 848.3730 857.1919 869.7782 950.5437 951.6204 991.5018 1012.6828 1015.5707 1059.7697 1092.6939 1099.7867 1139.8116 1154.9137 1168.3874 1234.5059 1246.0775 1270.1691 1292.8555 1317.3066 1367.9242 1386.4245 1397.9588 1442.2952 1462.3341 1474.9381 1489.2277 1504.3576 1549.6007 1570.5545 1643.3929 1645.6475 2938.9405 2985.6126 3044.9088 3080.7123 3101.6743 3155.8901 3183.1503 3195.8872 3217.3226 3584.9883
redmass: 2.7585 4.4997 4.9690 5.8409 4.0917 1.1245 6.0133 3.1714 2.8131 5.6167 4.7551 1.2153 3.6568 8.7383 3.9393 8.8222 3.4450 5.3682 8.7033 6.5023 5.2653 4.5537 1.3839 1.7238 3.3842 3.6383 1.4326 4.2548 1.3403 2.2403 1.3054 2.5004 3.2095 2.2250 2.0114 3.2821 1.3474 1.9088 1.8015 2.0659 1.9183 1.4363 2.2441 1.6163 1.9638 1.3153 2.3932 2.3305 1.1510 1.0973 1.0596 4.8926 7.5683 8.8763 7.9912 6.9987 1.0691 1.0360 1.0905 1.1000 1.1004 1.0893 1.0910 1.0968 1.0981 1.0653
irintensity: 0.7259 1.7982 0.1224 0.2009 2.5236 0.5562 0.4339 2.5470 1.5040 14.3142 7.6529 131.2193 3.7518 5.6525 3.0037 0.7848 6.9688 9.3146 0.6516 1.6881 3.1110 6.6489 5.9874 98.1427 8.1176 22.7461 2.4670 1.3978 1.7565 9.3400 0.6025 7.1979 44.7705 16.5468 18.8604 7.7597 28.0444 165.6378 39.0604 31.0657 2.0734 0.2738 49.0552 7.5777 10.2793 25.8620 64.3342 12.7225 59.0968 9.9222 24.3146 217.8278 19.7054 273.7717 166.3293 156.5536 61.1325 39.3617 0.6725 43.0258 16.0558 10.9383 3.4243 1.9085 4.4591 55.4070
temp: 298.150 k
press: 1.00000 atm
elementType: 8 8 7 7 6 6 6 6 6 6 6 6 6 6 1 1 1 1 1 1 1 1 1 1
symmnumber: 1
zpe: 482932.6 jmol-1
zpe.correction: 0.183939 hartree
zpe.thermalcorrener: 0.195990 hartree
zpe.thermalcorrenthalpy: 0.196934 hartree
zpe.thermalcorrgfe: 0.145704 hartree
zpe.sumelectzpe: -645.998084 hartree
zpe.sumelectthermal: -645.986034 hartree
zpe.sumelectthermalent: -645.985090 hartree
zpe.sumelectthermalfe: -646.036320 hartree
dipole: 3.0540 -6.6576 0.1128
dipole: 7.3255
quadrupole: -67.5682 -89.1444 -83.7240
quadrupole: 12.6030 1.3471 2.0267
quadrupole: 12.5774 -8.9989 -3.5785 12.6030 1.3471 2.0267
hfenergy: -646.1820237 hartree
pointgroup: C01 [X(C10H10N2O2)]
dipole: 1.234672 2.6038274 0.0450041 debye
dipolederiv: -0.2637619 0.1275402 -0.0101492 0.1554271 -1.2502148 -0.1119531 -0.0085746 -0.0684339 -0.397993 -1.155031 -0.4054125 0.0347042 -0.4886621 -0.7983866 0.0282432 0.022133 0.0176461 -0.3713043 -0.7082336 0.1673047 0.0766868 -0.4410142 -0.6261727 -0.013647 0.0490467 -0.0760548 0.0542877 -1.4403219 -0.4830438 0.0749151 -0.140483 -0.4687586 0.0025449 0.0984751 0.0257828 -0.28273 0.0699716 -0.2161518 -0.0093389 -0.2365216 -0.620379 -0.0493204 -0.0300926 -0.0344012 -0.1274138 0.6051627 -0.0200457 -0.0588278 -0.1811817 1.2250029 0.130845 -0.0650519 0.0908174 0.1130539 -0.0235587 0.0089546 -0.0114485 -0.0083688 0.1379658 0.0748271 -0.1349178 0.0922015 0.0863123 0.9182202 0.524337 -0.049342 0.5630901 0.6607762 -0.0163672 -0.0327453 -0.0051931 0.107931 1.6233873 0.5193145 -0.0861148 0.4497128 0.9854265 0.017442 -0.0764626 0.0173871 0.2026117 0.5125833 -0.1373533 -0.058214 0.2944268 0.0348663 -0.0157377 -0.0326683 0.0191422 -0.0468978 0.0125742 0.0190334 -0.0376643 0.0616452 0.0292672 -0.0362139 0.097136 -0.0510008 0.0103525 -0.3702386 -0.29383 0.0028185 -0.0358075 0.0384084 0.018389 0.0193164 0.0467529 -0.1692532 -0.2510052 0.2626456 0.0154133 0.0421458 -0.184056 0.0032239 0.0070612 -0.0248692 -0.20655 0.1612611 -0.0375473 -0.0344887 0.010447 0.3279254 0.0260717 -0.0268676 0.0365084 -0.0930405 0.0480092 -0.0034761 0.035766 -0.088613 0.0589725 0.0959149 0.0141222 0.0331716 0.0156853 -0.0028401 -0.0285382 -0.051805 0.0641601 -0.159236 -0.1670459 -0.0084125 -0.098253 -0.0091495 0.1236096 0.0119493 0.0089796 -0.012129 0.0490614 -0.0090478 0.0063973 -0.0117847 0.1877617 -0.2198676 0.0881727 -0.0003467 0.1090354 0.0798319 0.0050583 -0.014051 -0.0022678 0.0627102 0.1469426 0.0210419 0.0033688 -0.0429606 -0.0372476 -0.098525 0.0324996 -0.0468734 0.0454048 0.036499 -0.1013782 0.073476 -0.0487604 -0.0162437 0.1217156 0.0153258 0.0752567 -0.0290888 0.0910744 -0.0175805 0.006421 0.029142 0.0054121 -0.0156001 0.0104452 -0.0113679 0.1670043 0.0074786 -0.0798946 0.0096892 -0.0804192 0.0133729 -0.0044714 0.0108867 -0.0034678 0.1722187 -0.0766374 0.0651684 0.0282541 0.0617411 0.079312 -0.0127183 0.0287143 -0.0132945 0.1564936 0.1547225 0.0087898 0.0372475 -0.0360523 0.4350935 0.0263721 0.0182847 -0.0074045 0.3515934 unknown
polarizability: 208.6445565|13.7061872|134.2295128|-7.7447479|3.7957116|62.506869 unknown
InChI: InChI=1S/C10H10N2O2/c1-2-7-9(13)11-8-5-3-4-6-12(8)10(7)14/h3-6,14H,2H2,1H3
charge 0 multiplicity 1
24 atoms
O  -0.458004 2.395606 0.362324
O  -2.242916 -2.124285 0.16568
N  0.915734 0.536353 0.083035
N  0.070673 -1.760382 -0.01555
C  -1.479522 0.149669 0.304148
C  -0.40335 1.005365 0.256426
C  -2.905889 0.634026 0.458512
C  1.082327 -0.894926 -0.049169
C  -1.262201 -1.316169 0.15025
C  2.002226 1.418882 0.039919
C  -3.640456 0.736277 -0.906321
C  2.443333 -1.34798 -0.224001
C  3.287883 0.946102 -0.128802
C  3.513161 -0.468588 -0.263137
H  -3.435382 -0.108824 1.081928
H  -2.964996 1.603827 1.000343
H  1.751032 2.473926 0.147672
H  -4.68744 1.057988 -0.761513
H  -3.649604 -0.253895 -1.39163
H  -3.146735 1.454195 -1.586898
H  2.563788 -2.429017 -0.32252
H  4.115913 1.657838 -0.15809
H  4.531297 -0.847222 -0.396862
H  -1.394272 2.683532 0.502458
