program: Gaussian 09
title: 000266979
version: EM64L-G09RevD.01
frameworkgroup: C1[X(C13H12N2O2)]
method: RPBEPBE
basis: SDD
operation: Freq
keyword: #p
keyword: freq=noraman
keyword: PBEPBE/SDD
title: #p freq=noraman PBEPBE/SDD
converged: YES YES NO NO
title: Mulliken charges:
elementType: O O N N C C C C C C C C C C C C C H H H H H H H H H H H H
charge: -0.311106 -0.273574 -0.232713 0.001305 -0.253689 0.337082 0.340214 -0.390468 -0.159940 -0.390745 -0.405049 0.327438 -0.242604 -0.230717 -0.144059 -0.247722 -0.660669 0.305519 0.280834 0.237551 0.242311 0.237854 0.233291 0.232704 0.222586 0.238569 0.218572 0.251672 0.235552
chargesum: 0.00000
title: Mulliken charges with hydrogens summed into heavy atoms:
elementType: O O N N C C C C C C C C C C C C C
charge: -0.311106 -0.273574 -0.232713 0.001305 0.051830 0.337082 0.340214 -0.152917 0.120894 -0.148433 -0.167195 0.327438 -0.009312 0.001987 -0.144059 0.213432 0.045127
polarizability: 2.36141264e+02 5.39863568e+00 1.48074324e+02 6.97233977e+00 1.21768832e+01 1.01995699e+02
1716.lowfreq: -15.0943 -5.2209 -3.5482 -0.0004 -0.0003 0.0006 24.2950 34.1959 65.0629
frequency: 23.2928 33.2552 65.0538 85.6969 98.2147 106.3747 126.2208 182.7508 209.6782 227.8729 281.9892 295.9444 305.4127 339.2488 399.0648 406.3605 422.9488 475.6368 497.7947 527.4432 533.8703 580.2037 631.3368 643.5838 694.9994 726.0955 744.1547 755.5718 780.2161 795.8933 806.2430 832.4439 867.4194 881.9785 898.5982 936.5239 946.1095 954.8334 989.8669 995.2411 1034.7046 1058.3318 1095.6564 1104.0736 1129.6746 1155.7790 1176.4506 1195.7312 1218.9442 1232.2143 1276.3695 1276.8339 1281.4209 1296.6624 1334.9699 1359.0958 1381.1472 1390.2477 1409.1462 1447.7669 1457.0098 1461.0676 1484.1184 1490.8905 1579.7021 1613.6088 1638.6737 1645.8661 2185.2795 2994.6459 3032.9989 3049.9641 3090.4402 3096.4341 3122.5241 3123.7431 3130.1605 3147.0483 3166.1337 3167.5408 3199.1310
redmass: 3.9546 3.3978 4.7696 7.2278 9.2922 5.0620 3.2214 3.3609 1.3932 4.6865 5.8055 2.8376 6.2624 5.9245 4.3691 3.6861 4.2212 6.6823 4.6642 5.6935 4.9714 3.6372 6.1667 5.9923 7.4200 3.8881 3.1578 1.3640 3.6770 1.5658 1.3382 3.5863 2.9205 2.0732 3.8790 4.0831 1.3111 1.4849 1.3404 2.5901 2.3260 5.1415 2.1842 2.2057 1.5667 1.6733 1.0625 1.9320 1.8477 1.8917 1.3874 1.8544 1.7827 1.5826 1.3890 1.3639 4.8723 1.2415 2.1775 2.4129 1.0892 1.0523 1.0535 2.9106 6.7048 6.6450 10.2885 6.7860 12.5702 1.0362 1.0597 1.0834 1.0973 1.1033 1.1063 1.0878 1.0888 1.0937 1.0907 1.0984 1.0985
irintensity: 0.9429 1.0217 1.7093 1.6533 2.8396 0.7585 0.0126 3.3352 3.0693 2.4479 5.4584 10.3341 0.8685 10.4180 1.5829 8.4439 4.7760 4.3184 1.8515 1.0362 2.0851 1.8073 1.6892 5.1507 14.4033 9.9074 20.6325 18.8265 19.1444 81.4964 4.3087 7.6359 18.4061 27.5545 23.9911 36.6187 9.0254 1.3564 0.2322 33.2409 4.2959 214.2591 51.8956 35.4639 7.4580 51.1631 0.4875 28.2930 180.3943 70.3411 29.0137 338.5209 47.0686 21.0263 57.5380 38.7596 36.1260 25.4685 48.6302 44.9444 37.3076 16.5137 20.8548 11.2821 6.0759 17.8760 417.5626 76.0859 0.2342 16.7744 32.5239 1.6043 36.1702 0.5224 24.4462 6.4287 2.6061 22.2769 24.6539 13.5189 7.2173
temp: 298.150 k
press: 1.00000 atm
elementType: 8 8 7 7 6 6 6 6 6 6 6 6 6 6 6 6 6 1 1 1 1 1 1 1 1 1 1 1 1
symmnumber: 1
zpe: 585199.0 jmol-1
zpe.correction: 0.222891 hartree
zpe.thermalcorrener: 0.238182 hartree
zpe.thermalcorrenthalpy: 0.239126 hartree
zpe.thermalcorrgfe: 0.178796 hartree
zpe.sumelectzpe: -761.311635 hartree
zpe.sumelectthermal: -761.296343 hartree
zpe.sumelectthermalent: -761.295399 hartree
zpe.sumelectthermalfe: -761.355729 hartree
dipole: -0.8587 -0.2753 -3.0815
dipole: 3.2108
quadrupole: -79.3090 -99.4433 -107.4053
quadrupole: -7.5885 -2.4276 12.4294
quadrupole: 16.0769 -4.0574 -12.0194 -7.5885 -2.4276 12.4294
hfenergy: -761.5345253 hartree
pointgroup: C01 [X(C13H12N2O2)]
dipole: -0.3465774 0.1501742 -1.2054163 debye
polarizability: 236.4046792|2.1694466|141.1025289|7.1075849|20.2456654|108.7040797 unknown
InChI: InChI=1S/C13H12N2O2/c1-2-17-13(16)15-8-7-10-5-3-4-6-11(10)12(15)9-14/h3-8,12H,2H2,1H3
charge 0 multiplicity 1
29 atoms
O  2.574165 -0.448111 -0.943798
O  2.843054 1.710046 -0.042704
N  0.77082 0.597394 0.024752
N  0.443484 -2.42587 1.753679
C  0.017218 -0.661313 -0.231887
C  -1.485161 -0.401206 -0.397525
C  -2.072786 0.717141 0.263364
C  -1.200024 1.682449 0.933652
C  0.154785 1.635294 0.764251
C  -2.28315 -1.302156 -1.129328
C  -3.480959 0.889473 0.189301
C  2.133137 0.707682 -0.299033
C  -3.683718 -1.11761 -1.198832
C  -4.280554 -0.022321 -0.530199
C  0.258827 -1.637156 0.87831
C  4.031453 -0.480509 -1.286916
C  4.858165 -0.948576 -0.088106
H  0.428919 -1.117712 -1.147878
H  0.847454 2.387097 1.147251
H  -1.636083 2.496235 1.518861
H  -1.820098 -2.160285 -1.631335
H  -3.94126 1.748439 0.691303
H  -4.302054 -1.824083 -1.76208
H  -5.365714 0.120088 -0.575424
H  4.076272 -1.190029 -2.128293
H  4.331882 0.528207 -1.619879
H  5.916328 -1.059924 -0.389492
H  4.810468 -0.213205 0.732168
H  4.499028 -1.92388 0.282517
