program: Gaussian 09
title: 000266978
version: EM64L-G09RevD.01
frameworkgroup: C1[X(C15H23NO2)]
method: RPBEPBE
basis: SDD
operation: Freq
keyword: #p
keyword: freq=noraman
keyword: PBEPBE/SDD
title: #p freq=noraman PBEPBE/SDD
converged: YES YES NO NO
title: Mulliken charges:
elementType: O O N C C C C C C C C C C C C C C C H H H H H H H H H H H H H H H H H H H H H H H
charge: -0.257866 -0.273622 -0.094872 -0.435194 -0.349110 -0.323539 -0.329909 0.510337 0.264286 -0.691307 -0.687986 -0.451167 -0.388089 -0.224813 -0.236159 -0.245479 -0.264166 -0.663457 0.237561 0.223663 0.256271 0.182258 0.207206 0.179766 0.242873 0.226624 0.214859 0.210478 0.226648 0.205729 0.210583 0.233202 0.262039 0.224734 0.224518 0.227828 0.233967 0.222598 0.247223 0.227748 0.213734
chargesum: 0.00000
title: Mulliken charges with hydrogens summed into heavy atoms:
elementType: O O N C C C C C C C C C C C C C C C
charge: -0.257866 -0.273622 -0.094872 0.026031 -0.092839 0.065926 0.092730 0.510337 0.264286 -0.039345 -0.045026 -0.217965 -0.126050 -0.000079 -0.011641 -0.017651 0.192398 0.025248
polarizability: 2.16552884e+02 7.34846745e+00 1.47645271e+02 -8.82997056e-01 -8.38005422e+00 1.60870204e+02
1716.lowfreq: -12.9624 -3.4631 -0.0004 0.0002 0.0005 6.5811 20.6131 29.9171 37.5842
frequency: 20.0837 29.7602 37.5306 47.5618 52.3958 62.8203 74.1972 87.1500 97.9735 125.8937 152.2712 173.0856 205.4535 223.8816 226.6453 249.8184 284.1464 293.9484 295.1161 333.8339 354.2536 403.9215 411.6804 445.5576 466.2998 483.6844 516.7657 581.2710 612.2167 647.0047 700.9061 708.5629 738.2266 765.4879 780.9637 796.4997 801.1748 816.0197 840.9156 855.1858 871.2639 913.7234 921.1252 977.9695 985.7755 989.9234 995.0180 998.3500 1012.5119 1028.6298 1043.5681 1069.1924 1081.0764 1082.4541 1090.9653 1095.3239 1116.2394 1126.6896 1157.1197 1163.4818 1171.8763 1189.6913 1195.6494 1213.5012 1246.6791 1257.7712 1277.2280 1288.9517 1311.3723 1331.4766 1335.5500 1346.1998 1359.9032 1368.2569 1380.9647 1383.3533 1384.3498 1388.4545 1391.0867 1441.9788 1456.6116 1458.7093 1460.8375 1464.6123 1469.5397 1472.9676 1475.9423 1480.5443 1483.3716 1487.1454 1493.9688 1591.1295 1609.4141 1627.5440 2835.9771 2853.9793 2953.4054 2978.9840 2981.6803 2992.2139 3026.8971 3029.4036 3036.0059 3045.8701 3067.6637 3074.1673 3076.9907 3086.3233 3086.4644 3088.1236 3091.3824 3117.4012 3117.7628 3123.0620 3135.3299 3145.2319 3162.0217
redmass: 3.6176 3.5036 3.3320 3.3009 2.9975 3.4266 2.2794 2.2899 5.5485 2.9245 2.7395 2.3172 1.3390 2.7646 2.1722 1.3838 2.4202 1.8214 2.7666 4.3756 2.7592 2.8423 3.3553 2.6028 2.7046 3.0805 3.6306 4.6404 6.0348 3.9985 4.3013 1.8305 2.8782 2.0539 1.7485 1.2710 1.1737 1.6483 3.4787 1.2511 2.9613 2.1377 1.4489 1.3900 2.2831 5.6701 1.5196 1.9695 2.3511 2.1674 3.7935 2.6118 1.6758 2.5768 1.7218 2.1517 2.1522 2.4401 1.6708 1.7806 1.0621 1.1146 2.4856 2.5353 1.5603 1.2809 1.1223 1.1853 1.4262 1.2541 1.2341 1.2756 1.4581 1.3333 1.2246 3.8741 1.3948 1.2614 1.2680 2.1516 1.0873 1.0728 1.0516 1.0561 1.0621 1.0677 1.0714 2.2068 1.0524 1.0548 1.0732 6.0941 6.0530 8.1259 1.0720 1.0711 1.0629 1.0352 1.0353 1.0358 1.0975 1.0591 1.0873 1.0897 1.0872 1.0970 1.0974 1.1003 1.1003 1.0977 1.1031 1.0860 1.1061 1.0869 1.0918 1.0962 1.1015
irintensity: 0.4309 0.6130 0.2847 0.7236 0.1544 0.2276 0.1767 0.3738 0.9829 1.9275 1.6885 2.3548 1.8557 0.9762 0.4366 0.5504 3.4218 0.1139 1.9579 6.8228 11.5784 0.1758 6.1667 2.2061 2.7801 3.0862 30.3232 11.9548 0.3370 3.5731 8.4250 48.4543 0.8605 30.9416 13.7277 6.2040 7.6075 5.2107 2.5440 0.3178 2.3306 2.5703 1.3779 0.1582 10.2480 0.0314 2.4435 5.7711 47.0634 6.6679 64.4386 18.7149 9.5352 12.3200 51.7359 30.7538 81.3284 208.6278 12.9278 34.7853 1.1772 0.1027 12.2665 38.9307 7.3264 36.1460 5.4422 14.0543 43.2611 1.0790 18.2610 17.8339 14.1484 0.6125 14.1446 3.8032 14.8724 2.8367 25.0667 11.2369 12.6583 3.6890 10.2382 3.0430 3.9691 6.8683 13.4235 29.2099 18.9024 10.1508 10.0410 3.4003 19.9836 107.4268 83.6420 178.7063 48.5322 27.8946 30.1538 20.0926 9.8344 31.3089 14.1402 1.2825 25.6843 37.5641 69.8831 24.0076 85.8106 23.4716 1.0272 6.0065 33.0729 0.1173 15.1589 32.4802 28.0830
temp: 298.150 k
press: 1.00000 atm
elementType: 8 8 7 6 6 6 6 6 6 6 6 6 6 6 6 6 6 6 1 1 1 1 1 1 1 1 1 1 1 1 1 1 1 1 1 1 1 1 1 1 1
symmnumber: 1
zpe: 920667.2 jmol-1
zpe.correction: 0.350664 hartree
zpe.thermalcorrener: 0.370788 hartree
zpe.thermalcorrenthalpy: 0.371732 hartree
zpe.thermalcorrgfe: 0.299314 hartree
zpe.sumelectzpe: -789.186288 hartree
zpe.sumelectthermal: -789.166163 hartree
zpe.sumelectthermalent: -789.165219 hartree
zpe.sumelectthermalfe: -789.237638 hartree
dipole: 0.4035 -0.3862 0.9784
dipole: 1.1266
quadrupole: -101.6001 -102.9476 -108.3941
quadrupole: 1.8201 1.0585 0.9526
quadrupole: 2.7139 1.3664 -4.0802 1.8201 1.0585 0.9526
hfenergy: -789.5369516 hartree
pointgroup: C01 [X(C15H23N1O2)]
dipole: -0.23141 0.0367438 -0.3762327 debye
polarizability: 163.2797137|23.7408802|189.1296501|-3.1990104|-26.7802713|172.6589951 unknown
InChI: InChI=1S/C15H23NO2/c1-4-16(5-2)12-14(15(17)18-6-3)13-10-8-7-9-11-13/h7-11,14H,4-6,12H2,1-3H3
charge 0 multiplicity 1
41 atoms
O  1.587886 -0.678673 -1.297888
O  2.008616 0.477052 0.683255
N  -0.630895 2.265024 -0.262662
C  -0.861964 1.135421 0.668364
C  -0.303528 -0.21549 0.116627
C  -1.859116 2.750431 -0.937722
C  0.218817 3.351891 0.298284
C  -0.619684 -1.377246 1.064104
C  1.201646 -0.07718 -0.102904
C  -2.497315 1.705785 -1.873204
C  0.922831 4.193092 -0.784559
C  -1.568853 -2.360914 0.688973
C  -0.014925 -1.462332 2.346017
C  -1.912788 -3.40774 1.574104
C  -0.355983 -2.509536 3.230019
C  -1.307588 -3.48475 2.849544
C  3.043376 -0.616631 -1.641963
C  3.353143 0.668431 -2.415122
H  -0.373711 1.334958 1.641362
H  -1.943846 0.994126 0.875878
H  -0.760367 -0.41253 -0.866812
H  -2.623351 3.093459 -0.191933
H  -1.585275 3.635708 -1.539092
H  -0.368826 4.028072 0.971023
H  0.99387 2.86739 0.917484
H  -1.763176 1.367753 -2.625985
H  -2.858402 0.820993 -1.317422
H  -3.36621 2.144392 -2.398211
H  1.507543 3.534538 -1.451278
H  0.211531 4.766746 -1.406281
H  1.610749 4.918859 -0.312233
H  -2.03517 -2.309032 -0.302692
H  0.735647 -0.718809 2.639173
H  -2.646923 -4.161937 1.268417
H  0.121695 -2.567101 4.214848
H  -1.570755 -4.296751 3.536777
H  3.628282 -0.676267 -0.707375
H  3.205338 -1.518875 -2.253279
H  3.186349 1.554912 -1.780221
H  2.717008 0.749414 -3.313288
H  4.411321 0.665948 -2.73673
