program: Gaussian 09
title: 000266976
version: EM64L-G09RevD.01
frameworkgroup: C1[X(C16H17NO3S)]
method: RPBEPBE
basis: SDD
operation: Freq
keyword: #p
keyword: freq=noraman
keyword: PBEPBE/SDD
title: #p freq=noraman PBEPBE/SDD
converged: YES YES NO NO
title: Mulliken charges:
elementType: S O O O N C C C C C C C C C C C C C C C C H H H H H H H H H H H H H H H H H
charge: 0.978939 -0.537388 -0.539430 -0.204115 -0.233796 -0.109547 0.521881 -0.695948 -0.236279 -0.252932 -0.440479 -0.335145 0.130389 -0.620320 -0.619868 0.292247 -0.331176 -0.345083 -0.249485 -0.225634 -0.219067 0.253585 0.249284 0.284593 0.282421 0.241233 0.249714 0.275554 0.216291 0.247896 0.275383 0.248459 0.212784 0.247334 0.278770 0.234309 0.237222 0.237403
chargesum: 0.00000
title: Mulliken charges with hydrogens summed into heavy atoms:
elementType: S O O O N C C C C C C C C C C C C C C C C
charge: 0.978939 -0.537388 -0.539430 -0.204115 -0.233796 -0.109547 0.521881 -0.193079 0.048313 0.029489 -0.199246 -0.085431 0.130389 0.119421 0.116758 0.292247 -0.083842 -0.066313 -0.015176 0.011589 0.018337
polarizability: 3.22006521e+02 -1.40693533e+01 1.89858063e+02 2.92699568e-01 -1.07621178e+01 1.51014808e+02
1716.lowfreq: -11.2007 -5.2871 -0.0015 0.0012 0.0013 3.1851 17.2124 20.9712 27.7596
frequency: 17.0458 20.4156 27.6905 43.7086 58.1422 63.8500 66.1441 127.2641 130.9076 138.5718 152.6910 204.1329 210.4790 224.8163 242.5516 247.7193 274.7299 283.4904 309.3533 320.4543 342.1726 386.8578 399.4716 404.0462 407.7727 412.7885 429.5336 453.0091 473.2800 520.4442 569.5052 596.7633 613.4363 622.3516 663.9138 696.0427 712.4734 767.6631 776.0520 800.0587 811.4668 847.6182 855.5583 858.0646 861.3376 921.3790 952.7306 957.4444 968.9889 977.6874 979.0819 989.5300 993.0119 995.8147 1013.1282 1014.3448 1027.4790 1049.7714 1079.5527 1087.1133 1110.0433 1111.0815 1169.5011 1170.7754 1174.8926 1185.8781 1189.8952 1204.5865 1206.7218 1223.0160 1291.6875 1304.7604 1320.8036 1387.6877 1387.9647 1397.2199 1404.0877 1416.1853 1436.3642 1443.1538 1453.3533 1463.9617 1468.3090 1472.9016 1477.8565 1479.9299 1573.7007 1593.1025 1594.6736 1602.1589 1614.7401 2917.6166 2921.1970 2970.1188 3035.9814 3040.1022 3041.7850 3096.7486 3098.3282 3131.5920 3131.9479 3140.4260 3147.9600 3151.2654 3159.5655 3160.5753 3167.0140 3171.4516
redmass: 5.0833 5.9925 4.5787 3.3459 3.7442 4.7174 4.0354 5.8588 5.0281 7.8445 4.6463 5.2659 1.2696 1.5750 2.5169 2.8932 4.7773 3.3248 5.2542 5.9755 2.9725 3.2878 2.8595 4.4309 2.8746 3.8952 7.8224 6.4662 5.9813 3.9195 2.7661 6.4523 6.4497 6.9804 5.7700 1.8396 4.0310 1.7265 3.4614 3.0035 9.4926 1.2455 4.3469 1.4335 1.8320 1.7523 6.6374 1.7092 1.5567 1.6223 3.1834 6.2008 1.3859 5.5309 1.3469 1.4439 2.0445 2.4321 1.2283 1.5884 1.3754 1.3762 1.1860 4.2136 1.0702 1.1620 1.1368 1.7833 1.6807 3.3563 1.6434 1.6025 1.3407 7.8664 8.0108 2.5879 1.1314 1.1399 2.2555 1.1676 1.0469 1.0529 1.1350 1.9079 1.0904 2.1228 6.6002 7.2112 6.2952 6.4722 7.0582 1.0465 1.0458 1.0637 1.0946 1.0875 1.0860 1.0982 1.0995 1.0852 1.0893 1.0880 1.0883 1.0924 1.0955 1.0962 1.0974 1.1014
irintensity: 1.5372 2.4504 2.1108 1.2494 0.5726 3.2612 0.8817 0.1297 1.0327 0.7887 0.0116 0.7923 2.1704 3.4083 1.3682 15.3975 4.9161 2.1927 4.9539 10.5820 1.3559 2.9623 0.1390 0.2901 0.2267 0.7572 54.9077 3.3021 51.7276 79.5445 18.2784 53.2803 3.3559 6.3618 9.1282 48.8039 3.5738 44.5306 27.0788 16.9155 90.2168 0.2016 34.7077 7.9919 12.9638 4.1149 69.6489 5.2476 0.9162 12.3589 61.8977 3.8303 0.5273 4.6872 0.2476 0.5641 0.4783 31.5887 0.0121 9.3205 12.9023 12.2963 4.4811 9.7267 6.6404 1.8569 35.4845 102.5964 12.9756 53.2793 78.4124 69.7135 18.8294 6.3110 2.2273 6.6396 26.4809 1.8665 24.2974 17.6850 23.3788 3.4269 32.1712 18.1716 30.6921 0.4342 75.3518 0.8566 6.6995 52.3346 15.2888 22.7397 85.0027 33.0308 8.1445 2.0469 48.0672 2.1384 2.4987 0.7146 9.9525 5.8068 3.2412 17.4478 3.4069 18.0528 11.8594 23.0333
temp: 298.150 k
press: 1.00000 atm
elementType: 16 8 8 8 7 6 6 6 6 6 6 6 6 6 6 6 6 6 6 6 6 1 1 1 1 1 1 1 1 1 1 1 1 1 1 1 1 1
symmnumber: 1
zpe: 767210.4 jmol-1
zpe.correction: 0.292215 hartree
zpe.thermalcorrener: 0.313333 hartree
zpe.thermalcorrenthalpy: 0.314277 hartree
zpe.thermalcorrgfe: 0.239223 hartree
zpe.sumelectzpe: -1296.673815 hartree
zpe.sumelectthermal: -1296.652697 hartree
zpe.sumelectthermalent: -1296.651752 hartree
zpe.sumelectthermalfe: -1296.726807 hartree
dipole: 9.2190 1.0980 2.3236
dipole: 9.5706
quadrupole: -139.7647 -126.2471 -131.1889
quadrupole: -22.9623 -9.4376 -0.9891
quadrupole: -7.3644 6.1531 1.2114 -22.9623 -9.4376 -0.9891
hfenergy: -1296.9660297 hartree
pointgroup: C01 [X(C16H17N1O3S1)]
dipole: 3.6512016 -0.627525 -0.6728911 debye
polarizability: 321.6002191|16.1301949|180.4683486|-1.3444482|-19.8474001|160.8108246 unknown
InChI: InChI=1S/C16H17NO3S/c1-17(2)21(19,20)15-10-8-13(9-11-15)12-16(18)14-6-4-3-5-7-14/h3-11H,12H2,1-2H3
charge 0 multiplicity 1
38 atoms
S  -4.609732 0.393127 0.134127
O  -5.079449 0.692078 1.661694
O  -5.207959 1.176644 -1.159771
O  1.803037 -1.237404 0.791329
N  -5.025234 -1.437946 -0.162539
C  -2.723179 0.589644 0.077897
C  0.058511 0.878135 -0.011857
C  1.563802 1.050168 -0.064111
C  -2.124726 0.889887 -1.155877
C  -1.996424 0.440545 1.271828
C  -0.719099 1.031985 -1.18734
C  -0.594306 0.583999 1.214094
C  2.373722 -0.200411 0.350084
C  -4.500657 -2.277004 0.940026
C  -4.618033 -1.850349 -1.525642
C  3.870336 -0.138494 0.222313
C  4.55867 1.024234 -0.22067
C  4.62041 -1.296667 0.568353
C  5.966476 1.026499 -0.315189
C  6.025146 -1.294126 0.471022
C  6.702413 -0.131486 0.028668
H  1.880098 1.876819 0.606178
H  1.880033 1.349187 -1.081086
H  -2.740937 1.039187 -2.048376
H  -2.516032 0.247083 2.215751
H  -0.226937 1.269221 -2.137764
H  -0.003898 0.459871 2.127431
H  -4.765576 -1.807141 1.90162
H  -3.402611 -2.455132 0.892232
H  -5.018442 -3.251767 0.883438
H  -4.953145 -1.084014 -2.244209
H  -5.152049 -2.79012 -1.756072
H  -3.524405 -2.026958 -1.638492
H  4.007199 1.931062 -0.489846
H  4.073621 -2.181862 0.909841
H  6.489881 1.926494 -0.655303
H  6.594228 -2.191117 0.737808
H  7.795451 -0.128066 -0.046787
