program: Gaussian 09
title: 000266975
version: EM64L-G09RevD.01
frameworkgroup: C1[X(C22H21NO2S)]
method: RPBEPBE
basis: SDD
operation: Freq
keyword: #p
keyword: freq=noraman
keyword: PBEPBE/SDD
title: #p freq=noraman PBEPBE/SDD
converged: YES YES NO NO
title: Mulliken charges:
elementType: S O O N C C C C C C C C C C C C C C C C C C C C C C H H H H H H H H H H H H H H H H H H H H H
charge: 0.976788 -0.537951 -0.537628 -0.232998 -0.125483 0.442085 0.285353 -0.475709 -0.249764 -0.258950 -0.357213 -0.403874 0.223282 0.280640 -0.618962 -0.619013 -0.397671 -0.404026 -0.397166 -0.380725 -0.222716 -0.234557 -0.225021 -0.232503 -0.243858 -0.243116 0.232583 0.283358 0.284964 0.273214 0.244101 0.277436 0.247806 0.208633 0.276518 0.208646 0.247979 0.259343 0.247470 0.258069 0.256488 0.229303 0.229261 0.231481 0.229116 0.232253 0.232734
chargesum: 0.00000
title: Mulliken charges with hydrogens summed into heavy atoms:
elementType: S O O N C C C C C C C C C C C C C C C C C C C C C C
charge: 0.976788 -0.537951 -0.537628 -0.232998 -0.125483 0.442085 0.285353 -0.243126 0.033595 0.026014 -0.083999 -0.159773 0.223282 0.280640 0.114913 0.114130 -0.138327 -0.156556 -0.139097 -0.124237 0.006587 -0.005296 0.006460 -0.003387 -0.011605 -0.010383
polarizability: 4.65991344e+02 1.15343271e+01 2.88730295e+02 1.23294290e+01 -1.77161001e+00 1.89680652e+02
1716.lowfreq: -6.6459 -2.1970 -0.0012 -0.0008 0.0007 5.6158 16.3506 22.7393 34.0406
frequency: 16.1365 22.6663 33.9993 42.5976 54.2724 57.3768 61.7837 67.5707 75.5523 109.9670 121.6161 151.6818 183.0039 202.7781 207.1307 215.7664 218.4590 246.1037 249.2618 258.7778 282.6094 291.4969 304.4826 322.8366 355.6344 394.4122 403.0835 405.1262 408.9851 410.9341 440.7325 454.1092 471.1439 492.5573 531.7546 560.7817 603.7554 610.6017 615.3251 623.8705 647.5707 665.3025 701.4299 705.3557 715.3614 734.8652 768.9367 780.5093 805.7770 816.1062 838.5371 844.1148 853.1599 856.6269 859.0628 887.7177 918.0029 930.6830 942.3645 952.4333 971.2977 979.3607 980.6658 982.1207 988.2878 989.0585 990.0197 997.6734 998.6579 1016.9680 1025.2043 1030.1221 1047.6303 1081.0330 1081.8064 1086.5514 1110.4449 1113.4955 1144.7949 1173.4685 1173.6718 1174.0905 1187.2200 1190.1893 1194.4629 1207.7608 1227.7715 1262.2031 1298.4218 1313.8671 1319.4760 1354.7106 1369.1997 1377.1070 1394.8391 1400.4753 1405.8693 1417.7912 1431.5279 1436.1139 1452.9601 1464.7608 1465.7664 1468.6414 1478.2833 1479.4145 1485.1902 1570.7084 1578.7305 1579.3330 1583.6760 1599.9345 1607.6949 1611.3739 2914.6433 2917.0544 3038.2116 3039.5196 3095.6653 3096.2603 3097.1111 3125.2745 3125.7855 3130.8289 3131.4048 3131.6625 3143.6884 3144.0701 3150.7433 3152.0727 3152.2006 3159.6442 3166.5403 3166.7813 3177.6770
redmass: 4.8648 5.3295 4.5336 4.0532 3.8423 3.2074 4.0046 5.0357 3.8307 6.9771 4.4669 7.8965 4.9918 3.7178 2.2754 2.7807 1.2105 2.0459 4.6752 5.0122 6.5625 3.4466 4.9315 5.1356 4.4555 3.5449 2.9725 4.1759 2.9531 3.0615 8.3581 4.0959 3.8486 5.5698 3.2239 5.5138 5.6424 5.8809 6.4135 6.6326 3.9042 6.2046 1.7431 1.7903 3.5711 3.3443 2.0254 2.2021 9.8395 3.4171 1.6663 1.2646 1.2619 4.2532 1.2534 1.6233 1.9688 1.4422 2.3687 14.7282 1.3946 1.4608 1.3910 1.4018 5.2042 5.2532 5.1003 1.3335 1.3155 1.4222 2.4157 2.0475 2.4790 1.6109 1.2289 1.6097 1.3741 1.4379 2.8270 1.0548 5.2710 1.0532 1.1338 1.1169 1.1182 1.6627 2.0538 3.0966 1.3678 1.4105 1.3626 2.7316 6.5313 6.7025 3.5998 2.3197 1.1397 1.1394 2.2572 2.2579 1.0465 1.0513 1.6988 1.2131 1.2374 1.7449 2.3930 7.4756 5.6992 5.8858 5.8647 6.4164 6.1605 6.6421 1.0469 1.0464 1.0868 1.0852 1.0981 1.0875 1.0994 1.0846 1.0847 1.0890 1.0878 1.0874 1.0925 1.0921 1.0894 1.0964 1.0965 1.0955 1.1016 1.1016 1.0953
irintensity: 0.8111 1.4333 0.5866 1.0582 1.8836 0.6462 0.1546 0.2984 0.1849 2.0529 0.8673 0.9250 1.2638 0.7708 2.1999 0.5714 0.9419 2.8154 1.2954 2.1417 5.9517 3.9181 0.9486 15.3844 1.6281 4.0476 0.1600 3.3266 0.1695 0.2637 82.9197 16.2402 15.1791 69.4169 53.7775 35.7620 39.1270 3.6416 0.0233 12.7376 4.2139 3.2292 50.9351 44.5322 0.4599 13.0933 40.6756 43.8796 80.0062 42.3418 9.3850 2.0127 0.9899 34.7473 0.5404 33.6465 5.6299 2.6567 9.9452 69.4636 2.2561 1.0635 0.6254 0.4960 0.8345 1.0757 1.1065 0.4781 0.2684 0.5636 3.5378 9.5813 46.5744 7.7502 0.0705 6.1490 20.4025 6.6023 1.5101 0.0115 11.8229 0.0431 12.5759 0.6202 2.8067 15.8442 8.3957 3.0802 6.0525 0.4054 0.4005 5.1789 1.0473 1.3501 2.8654 15.6043 27.0035 2.5350 8.8251 15.3571 22.9986 4.1307 17.6942 2.3847 64.6385 4.6496 9.6108 5.8820 2.3447 1.9767 67.4519 4.9042 0.3366 27.2329 22.9164 83.0561 2.1271 55.9088 1.7208 23.5944 2.3429 4.0996 1.5702 8.8472 1.3609 0.5120 17.7902 10.9489 0.7228 37.7519 24.0365 4.0505 33.1563 20.1179 3.4198
temp: 298.150 k
press: 1.00000 atm
elementType: 16 8 8 7 6 6 6 6 6 6 6 6 6 6 6 6 6 6 6 6 6 6 6 6 6 6 1 1 1 1 1 1 1 1 1 1 1 1 1 1 1 1 1 1 1 1 1
symmnumber: 1
zpe: 965466.5 jmol-1
zpe.correction: 0.367727 hartree
zpe.thermalcorrener: 0.392477 hartree
zpe.thermalcorrenthalpy: 0.393421 hartree
zpe.thermalcorrgfe: 0.310610 hartree
zpe.sumelectzpe: -1452.167038 hartree
zpe.sumelectthermal: -1452.142287 hartree
zpe.sumelectthermalent: -1452.141343 hartree
zpe.sumelectthermalfe: -1452.224155 hartree
dipole: -6.8793 2.7239 4.0621
dipole: 8.4407
quadrupole: -184.5223 -147.0466 -161.6439
quadrupole: 16.2901 24.9053 -1.2242
quadrupole: -20.1180 17.3577 2.7603 16.2901 24.9053 -1.2242
hfenergy: -1452.5347644 hartree
pointgroup: C01 [X(C22H21N1O2S1)]
dipole: 2.6338635 1.5012208 -1.3553436 debye
polarizability: 466.8879468|-4.0543883|283.4387071|9.4235729|20.8633898|194.075638 unknown
InChI: InChI=1S/C22H21NO2S/c1-23(2)26(24,25)21-15-13-18(14-16-21)17-22(19-9-5-3-6-10-19)20-11-7-4-8-12-20/h3-17H,1-2H3
charge 0 multiplicity 1
47 atoms
S  -4.949448 -0.934475 0.6052
O  -5.506931 -2.356961 0.047103
O  -5.233583 -0.384515 2.10931
N  -5.71349 0.37331 -0.545474
C  -3.073367 -0.934378 0.350355
C  -0.284158 -0.934741 -0.022685
C  2.176319 -0.125476 0.030476
C  1.171796 -1.035282 -0.235002
C  -2.286163 -0.07961 1.144191
C  -2.527519 -1.81348 -0.600688
C  -0.891362 -0.083088 0.951311
C  -1.129029 -1.809808 -0.77178
C  1.915604 1.306193 0.389341
C  3.604013 -0.548642 -0.095233
C  -5.281921 1.733788 -0.152671
C  -5.48856 0.015088 -1.964146
C  1.096948 2.121804 -0.438634
C  4.006217 -1.884321 0.197885
C  2.512922 1.888772 1.540324
C  4.602976 0.375212 -0.515916
C  0.865217 3.475581 -0.113978
C  5.349576 -2.286427 0.049136
C  2.271662 3.240095 1.872427
C  5.946398 -0.027919 -0.666517
C  1.446019 4.039069 1.046961
C  6.326967 -1.361504 -0.388394
H  1.488025 -1.995917 -0.666156
H  -2.753142 0.539111 1.917508
H  -3.175547 -2.499577 -1.155621
H  -0.266196 0.558143 1.577403
H  -0.676139 -2.496468 -1.496734
H  -5.374969 1.834203 0.94151
H  -5.982904 2.448572 -0.621122
H  -4.246278 1.992286 -0.471011
H  -5.727848 -1.052256 -2.103946
H  -4.456429 0.22405 -2.327176
H  -6.200655 0.605366 -2.56922
H  0.652522 1.688034 -1.341064
H  3.267137 -2.598862 0.577349
H  3.159692 1.275441 2.177757
H  4.317731 1.408551 -0.740388
H  0.237665 4.091907 -0.767478
H  5.638286 -3.315921 0.288921
H  2.729445 3.669292 2.77055
H  6.696013 0.696926 -1.002948
H  1.263877 5.089246 1.300697
H  7.37131 -1.673311 -0.499833
