program: Gaussian 09
title: 000266972
version: EM64L-G09RevD.01
frameworkgroup: C1[X(C16H18ClNO2S)]
method: RPBEPBE
basis: SDD
operation: Freq
keyword: #p
keyword: freq=noraman
keyword: PBEPBE/SDD
title: #p freq=noraman PBEPBE/SDD
converged: YES YES NO NO
title: Mulliken charges:
elementType: Cl S O O N C C C C C C C C C C C C C C C C H H H H H H H H H H H H H H H H H H
charge: -0.056742 0.981539 -0.536293 -0.535929 -0.234035 -0.588540 0.533797 -0.586703 -0.107757 -0.403332 -0.396722 0.531175 -0.238989 -0.241265 -0.392932 -0.394914 -0.618606 -0.618413 -0.212056 -0.211326 -0.107585 0.232658 0.232292 0.227374 0.227043 0.246606 0.246230 0.283569 0.284458 0.237485 0.237363 0.277056 0.208033 0.249981 0.276980 0.207976 0.250027 0.255234 0.255263
chargesum: 0.00000
title: Mulliken charges with hydrogens summed into heavy atoms:
elementType: Cl S O O N C C C C C C C C C C C C C C C C
charge: -0.056742 0.981539 -0.536293 -0.535929 -0.234035 -0.123591 0.533797 -0.132285 -0.107757 -0.156726 -0.150492 0.531175 0.044580 0.043193 -0.155447 -0.157551 0.116463 0.116571 0.043177 0.043936 -0.107585
polarizability: 3.41628368e+02 2.96879571e-01 2.01578850e+02 -1.74954325e+01 4.00376204e-02 1.42933406e+02
1716.lowfreq: -15.9879 -7.3837 -3.6691 -2.0168 -0.0019 -0.0017 0.0013 18.0125 21.8850
frequency: -9.5997 17.6098 21.8576 26.5595 45.3542 46.5472 52.6130 81.4233 124.0895 133.8531 157.1702 207.6634 219.2952 229.5169 233.7077 240.4559 250.4756 276.3002 287.1240 310.6672 338.6406 346.6409 374.7314 383.5024 397.9635 406.2470 407.2638 409.6665 433.1363 483.3205 504.8601 537.8442 594.6228 621.4576 627.2093 649.4887 715.1465 724.8698 784.9091 787.1635 801.4049 809.4364 830.4701 838.6232 852.6679 857.0855 870.0015 947.9134 951.9618 965.2645 965.8036 982.3975 988.8842 994.6106 999.1324 1002.0712 1016.8146 1046.5362 1072.7335 1079.7557 1090.9777 1109.6532 1115.5822 1144.0527 1173.3356 1182.3951 1183.9337 1207.6245 1211.6444 1215.3152 1264.1936 1267.8116 1296.5362 1299.9556 1319.0147 1376.0183 1385.1577 1395.2096 1396.0881 1404.8313 1417.2183 1454.5829 1463.9077 1467.7619 1470.4286 1474.7607 1477.5362 1479.0914 1488.3787 1587.0025 1589.9777 1591.6492 1600.7510 2915.0984 2918.3438 2988.6163 2998.8763 3037.6336 3039.0945 3040.5364 3064.9576 3096.6693 3098.1591 3125.9714 3128.5037 3130.2918 3132.0504 3158.0201 3160.9983 3168.8905 3171.8703
redmass: 3.8123 6.3346 6.6076 3.4919 4.0621 4.6799 3.0605 5.3156 8.8755 5.5907 4.9433 5.1582 1.5237 1.2174 3.6137 3.1493 3.5022 4.7853 3.4232 5.9813 2.7952 4.9328 3.0058 6.4182 3.7856 2.9751 3.0006 4.2837 7.6934 6.5937 3.3090 3.0546 6.4123 6.9155 6.9081 4.8069 4.0195 3.6379 5.1817 1.1889 1.9282 13.8387 1.2470 1.5957 1.2413 4.3420 2.4526 1.4021 13.7849 1.3912 1.3731 1.3795 1.6836 5.4049 4.2191 4.1002 1.4237 2.4462 2.7592 1.2292 1.3777 1.3714 1.2997 1.1158 5.2369 1.1393 1.1223 1.6965 2.5212 2.5278 1.2310 1.4343 1.2751 1.2635 1.3881 7.0660 7.3866 2.7152 2.6265 1.1293 1.1401 1.0465 1.0504 1.6579 1.1978 1.3994 1.0618 1.8328 1.1009 7.3269 7.3871 6.0416 6.3182 1.0469 1.0463 1.0592 1.0598 1.1015 1.0868 1.0854 1.1049 1.0982 1.0994 1.0899 1.0899 1.0891 1.0893 1.0948 1.0963 1.0948 1.0958
irintensity: 0.4619 2.6046 1.9865 0.1117 0.6528 0.8402 0.0152 1.3934 0.1709 1.3133 0.1661 0.7066 3.3025 0.9053 0.2917 1.1117 8.7173 0.2159 2.4827 10.8620 0.1602 1.9238 0.1843 1.7792 1.4406 0.0009 0.0092 0.0607 76.5156 91.9372 3.2724 104.9139 5.4984 0.0913 0.1268 26.5717 3.9368 2.1921 14.2047 0.3640 7.8812 91.9648 0.0126 85.2619 0.3519 40.9038 2.8034 0.2572 72.0157 0.3381 0.0024 0.0287 0.9834 3.5018 30.7153 14.1885 0.5231 28.3134 43.7239 0.0002 8.0872 20.6891 0.0520 12.8119 11.9274 5.1751 0.0408 15.9271 2.1565 1.6663 0.3209 14.3760 0.7075 1.0339 1.1486 0.0164 3.2875 14.3136 0.3509 23.5645 2.0731 24.0480 4.3591 25.0074 2.1513 48.0182 49.9559 54.8142 14.0409 0.4738 0.5631 16.4597 3.6538 23.3692 94.6358 3.8791 53.5303 0.5196 3.2975 46.5377 21.7842 1.8687 2.3051 10.7561 14.3784 11.9929 8.2418 0.8976 10.0053 6.6943 0.4716
temp: 298.150 k
press: 1.00000 atm
elementType: 17 16 8 8 7 6 6 6 6 6 6 6 6 6 6 6 6 6 6 6 6 1 1 1 1 1 1 1 1 1 1 1 1 1 1 1 1 1 1
symmnumber: 1
zpe: 791577.9 jmol-1
zpe.correction: 0.301496 hartree
zpe.thermalcorrener: 0.322516 hartree
zpe.thermalcorrenthalpy: 0.323460 hartree
zpe.thermalcorrgfe: 0.248338 hartree
zpe.sumelectzpe: -1682.097230 hartree
zpe.sumelectthermal: -1682.076210 hartree
zpe.sumelectthermalent: -1682.075266 hartree
zpe.sumelectthermalfe: -1682.150388 hartree
dipole: 4.1059 -0.1587 4.0452
dipole: 5.7661
quadrupole: -205.7036 -128.3615 -141.5566
quadrupole: 0.7816 -24.8246 -0.0133
quadrupole: -47.1631 30.1791 16.9840 0.7816 -24.8246 -0.0133
hfenergy: -1682.3987259 hartree
pointgroup: C01 [X(C16H18Cl1N1O2S1)]
dipole: 1.6373567 0.2571374 1.5489531 debye
polarizability: 341.1044687|-2.9942466|199.289853|-20.0158768|-11.3225991|145.7463023 unknown
InChI: InChI=1S/C16H18ClNO2S/c1-18(2)21(19,20)16-11-7-14(8-12-16)4-3-13-5-9-15(17)10-6-13/h5-12H,3-4H2,1-2H3
charge 0 multiplicity 1
39 atoms
Cl 8.124488 0.050672 -0.054917
S  -4.902559 -0.069697 -0.392555
O  -5.417163 1.247279 -1.195801
O  -5.440734 -1.575158 -0.688753
N  -5.342885 0.260993 1.424556
C  1.295299 -0.19639 -0.909767
C  -0.220725 -0.174305 -0.812363
C  1.975497 0.112592 0.466478
C  -3.011073 -0.112366 -0.553391
C  -0.947194 -1.36162 -0.529379
C  -0.935665 1.042035 -0.977771
C  3.492739 0.103897 0.369456
C  -2.353433 -1.344134 -0.398031
C  -2.341187 1.086425 -0.851488
C  4.226899 -1.095379 0.556937
C  4.208133 1.286657 0.05003
C  -4.905941 -0.861555 2.28454
C  -4.883725 1.605271 1.840251
C  5.633855 -1.123922 0.429296
C  5.614875 1.281886 -0.083011
C  6.306566 0.070655 0.108585
H  1.645714 0.549972 -1.647265
H  1.64654 -1.184698 -1.260807
H  1.617662 1.098032 0.820581
H  1.630916 -0.637601 1.203343
H  -0.409907 -2.311853 -0.426288
H  -0.389203 1.960217 -1.223952
H  -2.928319 -2.258824 -0.219651
H  -2.907969 2.008851 -1.01559
H  3.697858 -2.021242 0.813527
H  3.664651 2.228952 -0.09058
H  -5.197148 -1.81119 1.805736
H  -3.814318 -0.865623 2.505951
H  -5.458019 -0.77851 3.238346
H  -5.157376 2.332396 1.057723
H  -3.791972 1.666496 2.052147
H  -5.436269 1.871232 2.759655
H  6.193721 -2.051455 0.580162
H  6.16007 2.198814 -0.324938
