program: Gaussian 09
title: 000266962
version: EM64L-G09RevD.01
frameworkgroup: C1[X(C8H11N3O2)]
method: RPBEPBE
basis: SDD
operation: Freq
keyword: #p
keyword: freq=noraman
keyword: PBEPBE/SDD
title: #p freq=noraman PBEPBE/SDD
converged: YES YES NO NO
title: Mulliken charges:
elementType: O O N N N C C C C C C C C H H H H H H H H H H H
charge: -0.282050 -0.268557 -0.212056 -0.048083 -0.625259 -0.019434 -0.454196 -0.463671 -0.306868 -0.071692 0.033899 -0.361522 0.190666 0.288427 0.227167 0.285919 0.231745 0.243456 0.221722 0.221169 0.286616 0.228999 0.315245 0.338358
chargesum: 0.00000
title: Mulliken charges with hydrogens summed into heavy atoms:
elementType: O O N N N C C C C C C C C
charge: -0.282050 -0.268557 -0.212056 -0.048083 0.028344 0.268993 0.058890 0.011530 0.136023 0.214925 0.033899 -0.132524 0.190666
polarizability: 1.54118590e+02 -1.13058566e+01 1.15743511e+02 7.19773206e+00 -1.78463105e+00 6.79629565e+01
1716.lowfreq: -17.1642 -15.5185 -5.4852 -0.0008 -0.0007 -0.0002 44.0426 62.1472 85.8920
frequency: 43.7495 62.0921 85.8729 149.0062 195.9999 210.1607 241.7041 289.7743 347.2287 383.4309 418.2600 429.7731 503.6998 555.7546 561.9238 579.0397 596.6385 691.1961 694.1284 732.2996 741.8224 760.3957 771.2672 830.7828 872.9104 881.7118 918.6702 921.0884 934.7475 963.4838 998.6349 1025.9361 1036.6512 1055.5407 1101.9468 1141.6011 1151.9955 1168.6576 1197.5819 1216.2254 1241.8483 1272.5950 1300.7057 1315.2930 1322.7982 1337.4491 1380.1415 1465.5318 1470.5069 1471.5488 1490.4177 1505.7458 1586.6173 1626.2835 1636.7025 3002.8432 3019.6365 3029.3734 3070.3064 3078.5250 3094.2475 3124.9222 3168.3936 3189.5798 3542.9559 3701.4022
redmass: 3.5583 4.2165 3.2998 3.3295 6.1333 3.8947 3.1995 7.1990 3.4583 3.5502 1.1504 3.2379 3.8405 6.7788 1.1930 5.9757 2.3175 4.9625 2.9371 5.0923 6.4530 5.1922 1.8794 3.0319 2.4163 1.6021 2.5235 3.1474 2.5987 1.3358 2.7744 3.7054 2.1608 1.6945 1.6512 1.3101 1.4163 1.9150 3.3180 1.5360 1.3362 1.7045 1.4239 1.2679 1.4489 1.3302 1.8863 1.0843 1.4456 2.2962 1.0946 4.8605 2.4768 1.9710 7.9533 1.0593 1.0645 1.0663 1.1043 1.0895 1.1039 1.1000 1.0882 1.0996 1.0451 1.1045
irintensity: 1.2036 8.9031 0.9341 3.4148 3.2845 12.6086 2.5906 1.0996 4.8700 2.7289 143.6505 28.3778 4.1208 1.6752 132.2476 3.2492 4.8833 4.9571 1.5413 13.8986 0.3920 28.6257 72.9424 19.8403 4.8807 3.2987 25.2862 9.8673 48.5053 1.0799 26.2772 159.9212 12.9750 1.1872 12.4175 21.5200 17.5004 23.2943 23.1095 8.8503 54.8929 81.1479 8.6489 0.9309 50.9676 4.2395 35.6156 14.3199 53.1953 132.4526 3.1866 106.5538 156.2241 200.4312 746.6079 73.1375 17.5060 18.0211 24.1955 5.9636 45.1685 13.4523 0.3820 7.8102 99.0137 36.6352
temp: 298.150 k
press: 1.00000 atm
elementType: 8 8 7 7 7 6 6 6 6 6 6 6 6 1 1 1 1 1 1 1 1 1 1 1
symmnumber: 1
zpe: 501891.8 jmol-1
zpe.correction: 0.191160 hartree
zpe.thermalcorrener: 0.202634 hartree
zpe.thermalcorrenthalpy: 0.203578 hartree
zpe.thermalcorrgfe: 0.153181 hartree
zpe.sumelectzpe: -625.184663 hartree
zpe.sumelectthermal: -625.173189 hartree
zpe.sumelectthermalent: -625.172245 hartree
zpe.sumelectthermalfe: -625.222642 hartree
dipole: -0.5400 -5.7773 2.0707
dipole: 6.1609
quadrupole: -53.0519 -82.6438 -79.0268
quadrupole: -11.4258 -1.6660 -1.4265
quadrupole: 18.5223 -11.0697 -7.4526 -11.4258 -1.6660 -1.4265
hfenergy: -625.3758231 hartree
pointgroup: C01 [X(C8H11N3O2)]
dipole: -0.3778951 -2.3272591 0.5624695 debye
dipolederiv: -1.0007523 -0.1376464 0.0163821 -0.3671546 -0.4736409 -0.0288845 0.0066959 -0.0298085 -0.4743249 -0.6734305 0.2732268 -0.0169203 0.2713683 -1.2552941 0.0169771 -0.0093952 0.0089727 -0.3889066 -0.9714682 -0.2054765 -0.1652396 0.6191838 -0.9849193 0.0264165 -0.0694133 -0.1603856 -0.1890043 -1.0291335 0.5244644 -0.1127429 0.5049802 -1.0029528 0.0711109 -0.1609058 0.0845254 -0.3374691 -1.5014189 0.37796 -0.1389544 0.2343895 -0.2631196 0.1102517 -0.2099299 0.1617236 -0.7459826 1.3438795 0.0061012 0.0948964 0.1346565 0.4113943 -0.0199016 0.3407124 0.0533712 0.4450315 -0.0327392 -0.0459603 0.0435379 -0.0286847 0.0395192 -0.0344359 0.0089717 -0.1051166 -0.0867109 0.0270457 -0.0836756 0.0360087 -0.0498698 -0.0521701 -0.0746392 0.0512948 -0.0001887 -0.0355353 0.6965569 0.1176728 -0.0404612 0.0864708 0.3343715 -0.0355857 -0.2855387 -0.1076073 0.268044 0.627146 -0.200828 0.116818 -0.82419 0.4696494 -0.0829895 0.0870791 0.017673 0.029598 1.2117287 -0.3282315 0.1906181 -0.2904417 1.7600652 0.0145262 0.2099654 0.0296023 0.2668139 -0.9242804 0.0320732 -0.1141359 -0.2176178 -0.2015019 -0.0372021 -0.2167714 0.0342361 -0.320099 1.807041 -0.4086083 0.3530921 -0.1784618 0.9327449 0.0047359 0.4491265 -0.0466588 0.3434214 -0.0666521 -0.0268214 0.0158363 0.0183141 0.0011084 0.064447 0.0141994 0.0537977 -0.010009 -0.0841209 0.1128075 -0.0274957 0.0889773 -0.014709 0.0560624 -0.0180988 0.0708741 0.0540231 0.105466 -0.0739946 -0.0827617 -0.0436771 0.0492257 -0.0424821 -0.1012186 -0.0167864 0.0327611 0.0040784 0.0710578 -0.1134497 0.0643895 -0.0165835 0.0578699 -0.0910092 0.0394736 0.0036314 -0.080605 0.0186522 0.1223759 0.0238583 0.105757 -0.0140981 0.1126647 -0.0111887 0.005045 0.047539 0.0238665 0.0179129 -0.075763 -0.1678101 0.0074358 0.0341312 0.0184365 0.0642344 -0.2172631 -0.0014819 -0.0592954 0.0790361 0.0545146 0.0362495 -0.0323613 0.0206275 0.0094214 0.1377481 -0.0798108 -0.0282197 -0.0846857 0.0478123 -0.0140914 -0.0143193 -0.0305078 0.1355876 0.053626 0.0459995 -0.0294619 0.0425432 -0.0765107 -0.0288877 -0.0409417 -0.0290903 0.1897838 0.2487513 -0.0205959 -0.0446201 -0.052653 0.1490135 -0.0391464 -0.0433019 -0.0340645 0.3700015 0.2712574 0.0092493 -0.0337194 0.0450312 0.154036 -0.0137388 -0.0216361 -0.0219104 0.3706436 unknown
polarizability: 151.4279756|-14.0850282|117.0138557|12.1486413|1.5861303|69.3832266 unknown
InChI: InChI=1S/C8H11N3O2/c9-6-3-4-11(8(12)10-6)7-2-1-5-13-7/h3-4,7H,1-2,5,9H2
charge 0 multiplicity 1
24 atoms
O  -2.22666 -0.567772 -1.194087
O  0.47416 2.335414 0.066786
N  -0.082969 0.08738 -0.278944
N  2.160129 0.723373 0.400411
N  3.797215 -0.893877 0.69718
C  -1.471428 0.553516 -0.644868
C  -2.261548 1.044349 0.588952
C  -2.929465 -0.253524 1.105928
C  -3.273832 -0.988062 -0.204456
C  0.2881 -1.232751 -0.35238
C  0.877065 1.134331 0.07603
C  1.576399 -1.627989 -0.035905
C  2.498989 -0.584695 0.354713
H  -1.352572 1.328331 -1.418226
H  -3.023952 1.769778 0.252301
H  -1.609151 1.545845 1.317438
H  -2.216563 -0.840741 1.711926
H  -3.823658 -0.054098 1.719195
H  -3.236892 -2.088629 -0.132241
H  -4.255603 -0.678861 -0.608644
H  -0.484912 -1.924305 -0.696556
H  1.870314 -2.677375 -0.099516
H  4.14423 -1.848572 0.686598
H  4.415001 -0.125165 0.952566
