program: Gaussian 09
title: 000266961
version: EM64L-G09RevD.01
frameworkgroup: C1[X(C9H11NO2)]
method: RPBEPBE
basis: SDD
operation: Freq
keyword: #p
keyword: freq=noraman
keyword: PBEPBE/SDD
title: #p freq=noraman PBEPBE/SDD
converged: YES YES NO NO
title: Mulliken charges:
elementType: O O N C C C C C C C C C H H H H H H H H H H H
charge: -0.257176 -0.294380 -0.691566 -0.149777 0.228248 -0.321804 -0.317014 0.277773 -0.341601 -0.399492 -0.273008 -0.208696 0.265513 0.232429 0.222361 0.225263 0.235836 0.259908 0.213550 0.225173 0.220566 0.354400 0.293493
chargesum: 0.00000
title: Mulliken charges with hydrogens summed into heavy atoms:
elementType: O O N C C C C C C C C C
charge: -0.257176 -0.294380 -0.043673 0.115736 0.228248 0.132986 0.144086 0.277773 -0.081693 -0.185942 -0.047835 0.011870
polarizability: 1.28439459e+02 3.38552657e+00 1.19847285e+02 -5.73727935e+00 -1.41177602e+00 6.75985575e+01
1716.lowfreq: -18.3542 -5.5603 0.0005 0.0007 0.0009 5.1577 26.8802 65.7924 87.9875
frequency: 19.6073 65.5225 87.9740 161.8929 206.6000 251.2401 323.1238 357.4123 421.9600 441.6694 473.0882 533.9107 547.8050 611.5063 630.8403 679.1164 709.0829 717.9624 758.6546 810.7821 820.3570 838.5638 846.0788 870.2988 888.8998 934.4810 952.5499 955.9731 976.5472 1016.5896 1028.2933 1052.8036 1107.1219 1133.7678 1169.0994 1172.3819 1189.7297 1193.3479 1238.6925 1272.2978 1295.3935 1310.3480 1317.5150 1324.5812 1391.9300 1451.7939 1471.4003 1483.8298 1491.8074 1583.3381 1616.1686 1631.6642 3001.1289 3014.4061 3053.1233 3084.4706 3107.9532 3112.9490 3132.8790 3142.9836 3164.8379 3488.4716 3662.4462
redmass: 2.0935 3.4034 3.6592 4.1718 5.8838 4.0431 5.3857 5.2576 1.2271 2.8152 3.7711 3.7486 5.5757 3.8048 1.2458 5.3896 6.7846 2.8387 1.4847 1.7938 4.5596 2.6695 1.4868 3.4024 5.0858 4.0030 1.7677 2.9552 1.3324 3.8808 2.5030 1.8234 1.5992 1.3818 1.0855 1.1357 1.1508 2.2553 1.2455 1.6497 1.2856 1.2281 1.3515 1.7742 6.9207 2.7634 1.0913 1.1263 2.7056 5.8288 2.2114 1.8336 1.0625 1.0626 1.0874 1.1033 1.1056 1.0866 1.0884 1.0931 1.0999 1.0492 1.1000
irintensity: 0.2643 1.8194 4.1482 3.6143 2.1558 14.9071 11.3640 3.1213 149.6910 7.4030 4.3286 10.9549 2.4590 18.5125 137.5918 10.4779 2.0076 8.6882 90.4910 15.9398 17.8985 36.6606 2.0920 20.1093 21.1475 28.6779 5.3081 12.6941 3.4582 63.6271 51.1655 34.3844 1.5376 2.9488 16.2026 1.8518 0.4072 20.8483 3.4936 40.5354 12.0159 1.9407 11.4772 27.5303 5.0457 28.8844 5.4267 10.8252 67.7564 13.2196 18.2099 238.3500 24.0523 74.0396 13.1084 5.9817 57.7830 12.5002 10.1381 21.3575 23.9737 109.4514 50.2137
temp: 298.150 k
press: 1.00000 atm
elementType: 8 8 7 6 6 6 6 6 6 6 6 6 1 1 1 1 1 1 1 1 1 1 1
symmnumber: 1
zpe: 489290.9 jmol-1
zpe.correction: 0.186361 hartree
zpe.thermalcorrener: 0.196877 hartree
zpe.thermalcorrenthalpy: 0.197821 hartree
zpe.thermalcorrgfe: 0.148917 hartree
zpe.sumelectzpe: -553.841362 hartree
zpe.sumelectthermal: -553.830846 hartree
zpe.sumelectthermalent: -553.829902 hartree
zpe.sumelectthermalfe: -553.878806 hartree
dipole: 0.2983 1.2093 2.3523
dipole: 2.6617
quadrupole: -64.9004 -64.3542 -72.4887
quadrupole: -3.1410 4.1749 -1.0055
quadrupole: 2.3474 2.8935 -5.2410 -3.1410 4.1749 -1.0055
hfenergy: -554.0277231 hartree
pointgroup: C01 [X(C9H11N1O2)]
dipole: 0.1426541 0.2628081 1.0035884 debye
dipolederiv: -0.8399114 0.1567313 -0.0503524 0.1527594 -0.5116431 -0.0425795 -0.1337432 0.056292 -0.4498947 -0.8621881 -0.0516368 -0.1462963 0.0087752 -0.521368 0.0040955 -0.1573914 -0.1105708 -0.5837377 -0.322216 -0.2282668 -0.1280363 -0.2098672 -1.3777455 -0.0141212 -0.1228285 0.1145323 -0.5994343 1.3018267 0.010224 0.0049217 0.0692535 0.5908007 0.0732216 -0.0257748 0.1014999 0.580106 -0.2899625 0.1738022 0.0199718 -0.2603328 -0.41572 0.0024718 -0.0979024 -0.1204482 -0.1897532 0.473778 -0.0212284 0.0740073 0.008301 0.2452163 -0.0817007 0.2120152 -0.2083957 0.2676174 0.4303897 0.0172012 0.0479719 -0.0663959 0.1291543 -0.1614586 0.1029567 -0.0306591 0.3771107 0.0480103 0.3598362 0.0733858 0.2093099 1.3230388 0.1519845 0.0894682 0.1468855 0.1230288 0.1351117 0.0129868 -0.1050348 0.2860377 0.1367447 -0.0187196 -0.0419507 0.0650871 -0.0722134 -0.0642778 -0.4189051 -0.155199 0.0264045 -0.2833597 -0.0063948 -0.0514638 0.1024112 -0.1765511 -0.357918 0.0616443 0.0334678 0.0436031 -0.0809411 0.017887 0.06863 0.0152886 -0.2412902 0.1352978 0.036499 -0.0915707 -0.142904 0.2331273 0.1081611 -0.1293727 0.0666259 -0.0701661 -0.0698065 -0.0103882 0.010397 -0.0455049 0.0137224 0.0953211 -0.0096969 0.0619231 -0.0444074 -0.1732644 0.0728318 0.0121008 0.022997 0.0706511 0.0025512 0.0262031 -0.0077445 0.0593123 0.0541534 -0.0906905 0.0418742 -0.0197111 -0.0865584 0.0918857 -0.0174545 0.1016904 -0.0262877 0.0036247 -0.0120643 0.126548 0.0184512 0.0275953 0.0695941 0.053101 0.0308825 -0.1131774 -0.0878667 -0.0774891 -0.0899151 -0.0836095 0.0396995 -0.0457672 -0.065631 -0.0206711 0.0432853 0.0640294 0.0871766 0.0638784 0.0814727 0.0408637 -0.0360514 0.0519935 -0.0484928 0.1055054 -0.0104582 0.0652272 0.0741967 0.1037221 -0.035772 -0.0831454 0.0898023 -0.0793593 0.1149642 0.0637521 -0.0525314 0.0228285 -0.0701522 -0.1137482 -0.0458271 0.0220327 -0.0458281 0.1577909 -0.1061278 -0.0752534 0.0722003 -0.072337 0.0713127 0.0067375 0.0761486 0.0160621 0.1286725 0.367422 -0.020084 0.026274 -0.0508448 0.2708148 -0.0425548 -0.0247604 -0.1278421 0.2968577 0.1066018 0.0043772 0.0623805 -0.0094281 0.2341145 -0.0455909 0.085619 -0.0791689 0.3126619 unknown
polarizability: 126.4420052|6.2237336|118.9162237|-9.0432694|9.4505497|70.5270723 unknown
InChI: InChI=1S/C9H11NO2/c10-8-4-2-1-3-7(8)9-11-5-6-12-9/h1-4,9H,5-6,10H2
charge 0 multiplicity 1
23 atoms
O  2.134947 -0.573207 -1.219278
O  1.84322 1.406855 -0.039643
N  -0.81065 2.235623 0.289974
C  1.158899 0.489108 -0.990739
C  -0.176929 -0.023243 -0.458701
C  2.80175 -0.797132 0.091103
C  2.525986 0.500263 0.916156
C  -1.129936 0.889504 0.10707
C  -0.530059 -1.381692 -0.627823
C  -2.419309 0.394863 0.465041
C  -1.803101 -1.866308 -0.255363
C  -2.748872 -0.961722 0.284106
H  1.058948 1.05534 -1.932576
H  3.868756 -0.958629 -0.128589
H  2.37537 -1.687662 0.588005
H  1.868879 0.29496 1.781743
H  3.439062 1.019827 1.244316
H  0.209225 -2.050658 -1.082289
H  -3.15568 1.087055 0.893009
H  -2.057399 -2.921678 -0.395959
H  -3.746877 -1.314877 0.569257
H  0.173429 2.510465 0.2769
H  -1.502959 2.867944 0.682478
