program: Gaussian 09
title: 000266960
version: EM64L-G09RevD.01
frameworkgroup: C1[X(C9H9NO4)]
method: RPBEPBE
basis: SDD
operation: Freq
keyword: #pfreq=noraman
keyword: PBEPBE/SDD
title: #p freq=noraman PBEPBE/SDD
converged: NO YES NO NO
title: Mulliken charges:
elementType: O O O O N C C C C C C C C C H H H H H H H H H
charge: -0.245492 -0.294722 -0.198819 -0.191867 0.024051 -0.115584 0.294219 -0.326567 -0.303514 0.229662 -0.344162 -0.344451 -0.220678 -0.214178 0.286519 0.243618 0.217365 0.225272 0.228174 0.288731 0.280526 0.238794 0.243100
chargesum: 0.00000
title: Mulliken charges with hydrogens summed into heavy atoms:
elementType: O O O O N C C C C C C C C C
charge: -0.245492 -0.294722 -0.198819 -0.191867 0.024051 0.170935 0.294219 0.134416 0.149932 0.229662 -0.055431 -0.063925 0.018117 0.028922
polarizability: 1.35642329e+02 -2.53301159e+00 1.33981785e+02 -1.24916418e+01 2.02222792e+00 7.40490112e+01
1716.lowfreq: -8.2188 -0.0006 -0.0004 -0.0004 6.0715 8.7956 39.5890 48.1410 78.2578
frequency: 39.5499 48.1009 78.2445 109.5801 139.7084 192.8764 232.8711 257.5658 316.2117 352.3734 380.5588 418.5613 503.2495 550.2856 602.4740 616.3168 656.2434 669.1999 696.1606 728.8025 783.6253 790.2028 826.4777 836.2347 868.1398 886.8592 907.7069 942.4509 971.2383 979.9932 1008.8384 1030.7143 1037.5308 1067.3343 1109.3357 1132.7394 1157.1299 1172.9428 1190.1958 1196.5744 1221.0043 1240.3294 1270.3991 1308.9103 1320.1344 1327.1593 1377.3016 1388.9206 1431.4273 1465.0089 1471.5460 1478.8415 1581.5414 1608.1636 2991.5958 3010.3615 3090.6655 3097.2227 3114.7853 3142.4713 3161.1226 3176.2047 3184.3322
redmass: 5.8490 3.7537 7.4347 4.2005 5.1472 8.1968 2.9664 4.7388 6.3954 8.1806 7.2751 3.7526 4.7012 5.8407 5.4237 2.5003 7.6234 6.4221 5.6001 3.8280 6.7899 1.6340 3.4877 3.4251 3.1013 5.1412 1.5171 2.6907 3.0321 1.3823 1.3440 5.2709 2.7138 3.2119 1.7143 1.8807 1.1439 1.1022 1.9671 1.2863 8.2930 1.3852 1.4157 1.2775 1.2609 1.2447 7.3581 8.1268 2.3529 2.6088 1.0903 1.0962 6.5834 7.0426 1.0676 1.0606 1.1040 1.0877 1.1014 1.0870 1.0919 1.0938 1.0984
irintensity: 1.9689 7.1069 0.1242 1.3145 1.2530 7.6203 1.3727 1.2522 5.4198 0.7897 8.4716 0.6279 3.4073 0.2667 11.7237 3.9142 9.4391 9.5019 18.7334 22.0609 20.9594 51.5331 23.7211 33.7994 22.8154 14.8466 10.9637 20.8715 13.4305 7.1452 3.8330 119.6604 27.2568 19.7250 6.1623 6.0936 2.3224 11.9119 46.0879 5.9671 172.4693 26.8469 12.3523 10.0638 1.8352 3.4068 139.4905 4.7941 16.7777 14.8518 5.9274 2.7808 7.4501 2.1498 39.7333 71.6867 24.7657 4.4609 24.7122 4.4660 9.1462 3.2535 10.1140
temp: 298.150 k
press: 1.00000 atm
elementType: 8 8 8 8 7 6 6 6 6 6 6 6 6 6 1 1 1 1 1 1 1 1 1
symmnumber: 1
zpe: 448268.5 jmol-1
zpe.correction: 0.170736 hartree
zpe.thermalcorrener: 0.182520 hartree
zpe.thermalcorrenthalpy: 0.183464 hartree
zpe.thermalcorrgfe: 0.131495 hartree
zpe.sumelectzpe: -702.856680 hartree
zpe.sumelectthermal: -702.844896 hartree
zpe.sumelectthermalent: -702.843952 hartree
zpe.sumelectthermalfe: -702.895921 hartree
dipole: 1.6651 5.2174 1.7004
dipole: 5.7346
quadrupole: -68.2680 -85.1922 -82.2316
quadrupole: -8.1524 5.6840 2.1545
quadrupole: 10.2959 -6.6283 -3.6676 -8.1524 5.6840 2.1545
hfenergy: -703.0274162 hartree
pointgroup: C01 [X(C9H9N1O4)]
dipole: -0.3554901 2.0062166 -0.9690243 debye
dipolederiv: -0.8233511 0.00272 -0.1091907 -0.027661 -0.4131144 -0.0555155 -0.1955012 -0.0717908 -0.5537454 -1.0482215 0.1359024 -0.0392428 0.1367051 -0.4227014 -0.0480721 -0.1590503 -0.0568927 -0.4665704 -0.4273408 0.1985192 0.1979462 0.220304 -0.7142869 -0.1068316 0.2034818 -0.0666512 -0.4185891 -0.4698796 -0.0176998 0.2283878 -0.0456842 -0.5764189 0.166805 0.2882764 0.0842993 -0.5382774 0.5932611 -0.1176879 -0.4801026 -0.1246304 1.4776337 -0.136694 -0.4966044 -0.0818087 0.7653595 1.2691893 -0.0527328 0.0079484 -0.069833 0.4639159 0.0933326 0.0234565 0.0645799 0.5587361 -0.122153 -0.0876402 0.0401243 0.1151758 0.0733114 -0.0495386 0.0212591 0.1003954 -0.1131454 0.3873532 0.0187247 0.0800808 -0.1287654 0.2058771 -0.1728902 0.0921655 -0.0338681 0.3516491 0.6766485 -0.0008899 0.0658713 0.1735932 0.2144865 -0.0390906 0.2739256 -0.1127042 0.2676952 0.1082824 -0.0350939 0.0388062 -0.0819972 -0.3987506 0.0764761 0.0237291 0.0771828 -0.0197401 -0.1412284 -0.1714146 -0.0126901 -0.1552165 -0.1380908 0.0381766 -0.0042447 0.0748827 -0.1128299 -0.0990999 0.0869479 -0.0306705 -0.0947971 0.0448926 0.0238184 0.0059463 -0.1262912 -0.0678272 0.0422783 0.0471152 -0.0581517 0.0096318 0.1820576 -0.0375486 -0.032595 -0.0495029 -0.0979954 0.0459421 0.0899198 -0.09803 0.1496292 -0.1431826 -0.0478469 -0.0932789 -0.0409711 -0.1013626 -0.0113347 -0.0152053 -0.0080766 -0.0379797 0.0493562 0.0578009 -0.0466018 0.0214361 -0.0105469 -0.0072331 -0.0713682 -0.0776843 -0.0870039 0.0309152 -0.0683039 -0.0804947 -0.0357087 0.0397804 -0.0252868 -0.0344356 0.1075984 0.0166458 -0.0097512 0.1246262 0.0491349 0.0571147 -0.0839641 0.0198819 0.021964 -0.0299354 0.1034051 -0.0683124 0.0838657 -0.0725684 0.0858654 0.0476485 -0.1744447 -0.0420414 0.0449667 -0.1350106 0.0384418 0.029367 0.0624865 0.0205946 -0.0045258 0.1011405 0.0781215 0.0249656 0.0816354 0.0564924 0.0082396 -0.0052446 -0.010627 0.1363492 0.0647106 0.0415583 0.0138813 0.0666132 0.0745269 -0.0104311 0.040974 0.0184142 0.1526112 0.0881058 -0.0157885 0.0175916 -0.0352097 -0.0910194 0.0386903 0.0272051 0.0406531 0.1414411 -0.0472203 -0.059495 0.0756062 -0.0495497 0.0637213 0.0315648 0.0741432 0.0413981 0.1278493 unknown
polarizability: 134.8554826|-0.3217178|131.8422802|-16.0720383|-8.828568|76.9753622 unknown
InChI: InChI=1S/C9H9NO4/c11-10(12)8-4-2-1-3-7(8)9-13-5-6-14-9/h1-4,9H,5-6H2
charge 0 multiplicity 1
23 atoms
O  -1.851687 -1.016404 -0.136493
O  -2.267096 1.070679 0.909154
O  1.859533 -2.633441 -0.256145
O  0.358681 -2.240647 1.410951
N  1.112572 -1.846344 0.441651
C  -1.307357 -0.048774 0.838916
C  0.063827 0.469065 0.381319
C  -2.706696 -0.211578 -1.04187
C  -3.351392 0.792907 -0.071351
C  1.170464 -0.389637 0.137722
C  0.250653 1.846475 0.121297
C  2.396872 0.086689 -0.374887
C  1.478833 2.345698 -0.368344
C  2.553482 1.46474 -0.624684
H  -1.261819 -0.573672 1.803426
H  -3.415865 -0.909993 -1.509977
H  -2.094121 0.29344 -1.814432
H  -3.634339 1.751996 -0.535365
H  -4.215901 0.352525 0.458533
H  -0.593452 2.514591 0.312431
H  3.204024 -0.62616 -0.564035
H  1.592623 3.419398 -0.551932
H  3.505263 1.844145 -1.009785
