program: Gaussian 09
title: 000266952
version: EM64L-G09RevD.01
frameworkgroup: C1[X(C24H27NO6)]
method: RPBEPBE
basis: SDD
operation: Freq
keyword: #p
keyword: freq=noraman
keyword: PBEPBE/SDD
title: #p freq=noraman PBEPBE/SDD
converged: YES YES NO NO
title: Mulliken charges:
elementType: O O O O O O N C C C C C C C C C C C C C C C C C C C C C C C C H H H H H H H H H H H H H H H H H H H H H H H H H H H
charge: -0.305015 -0.292598 -0.271512 -0.416818 -0.281352 -0.343134 -0.370290 -0.361731 -0.451907 0.379672 -0.636972 0.244355 0.462828 0.028250 0.166887 0.063112 -0.661183 -0.250401 -0.689350 -0.016808 0.015460 0.226698 -0.340946 0.216725 0.038652 -0.043341 -0.776954 -0.521087 -0.522529 -0.594669 -0.497022 0.293057 0.247665 0.232005 0.238277 0.232622 0.333425 0.270593 0.240487 0.290330 0.277039 0.243407 0.241052 0.250408 0.219975 0.255917 0.382108 0.229735 0.246853 0.235927 0.230707 0.270495 0.207434 0.214216 0.227204 0.252593 0.231963 0.207488
chargesum: 0.00000
title: Mulliken charges with hydrogens summed into heavy atoms:
elementType: O O O O O O N C C C C C C C C C C C C C C C C C C C C C C C C
charge: -0.305015 -0.292598 -0.271512 -0.034710 -0.281352 -0.343134 -0.036865 -0.068675 0.027763 0.379672 -0.166073 0.244355 0.462828 0.028250 0.166887 0.063112 -0.390590 -0.009914 -0.121980 -0.016808 0.015460 0.226698 -0.097539 0.216725 0.038652 0.197712 -0.050654 0.191427 0.186106 -0.153249 0.195022
polarizability: 4.22417845e+02 1.95818773e+01 3.04141877e+02 1.62651962e+00 1.68154210e+01 2.21775440e+02
1716.lowfreq: -9.5735 -5.8024 -0.0005 0.0002 0.0007 4.9335 23.2806 28.2346 28.4800
frequency: 23.1497 28.1511 28.3486 36.1804 49.2948 51.8079 57.1033 62.7419 74.9951 83.2057 85.7407 98.7764 104.8725 115.1873 129.8501 144.8548 149.3792 160.9771 163.1000 175.3963 187.1157 200.3809 213.8708 222.2690 243.3330 249.1354 265.5323 270.8274 287.1731 312.1865 318.5205 324.7148 349.0113 351.1998 365.7750 373.5031 390.7823 411.7142 422.7134 429.6305 441.5273 476.3376 496.1503 506.8677 513.2198 532.3486 552.7699 569.4861 570.8570 593.1586 612.7298 616.8113 626.7467 630.0439 655.0476 672.6989 699.7574 724.0275 735.1481 759.6645 772.2136 791.7826 798.5535 833.8318 845.1031 865.8085 873.5606 882.1372 899.4071 904.4440 915.8501 923.9846 940.4544 950.8464 961.9044 973.8564 982.9013 990.8323 1009.0282 1011.2056 1025.5569 1040.0493 1043.7792 1061.1130 1092.8641 1101.2950 1108.3187 1108.8484 1110.4042 1122.0775 1125.9129 1151.0549 1153.1100 1155.4548 1162.5644 1173.3818 1202.5213 1213.0979 1226.5624 1241.4825 1250.3850 1258.9886 1269.8965 1284.8178 1285.7977 1302.0699 1312.9769 1321.7707 1328.6223 1341.4816 1348.1133 1368.5620 1374.3329 1387.1363 1388.7348 1411.8565 1418.5201 1422.2381 1434.1534 1441.9766 1449.9169 1452.4112 1453.9524 1455.0373 1459.6860 1461.4877 1466.0444 1468.7859 1470.9151 1471.7434 1475.0938 1476.4562 1486.5212 1502.9415 1529.3377 1543.0093 1550.9124 1601.3832 1604.8328 1629.2556 1647.4050 2855.6120 2968.5123 2970.7994 2982.7533 2988.3466 2993.6956 2995.4396 2998.4188 3047.3461 3053.8583 3060.9300 3067.0791 3080.0708 3080.8766 3093.3011 3095.7943 3098.2153 3100.1319 3123.8884 3126.3361 3126.5237 3128.2617 3130.6424 3148.7612 3153.5125 3191.9579 3553.6624
redmass: 4.9099 4.8404 4.3390 4.5171 3.7686 3.6161 4.2165 3.2698 3.6726 3.7538 2.5274 1.6226 3.3051 2.9547 2.5398 2.1506 1.5885 2.3411 1.4387 2.8022 3.0937 1.7439 3.2796 3.5030 4.5716 2.5856 4.7135 3.9899 4.2831 4.7987 4.0113 4.5858 3.5585 4.2915 4.9994 4.7446 5.7859 5.0619 4.4379 4.4379 4.3031 3.7928 4.1015 3.5714 3.8925 4.2800 2.3950 2.8882 2.3891 2.9889 2.3425 3.5463 4.1192 4.2807 4.4388 4.7852 3.6984 3.5759 5.8241 6.0076 6.0783 5.0114 3.5514 2.4274 1.7749 6.2880 2.4141 1.8471 2.5783 1.1361 4.0892 2.2448 1.4352 4.1739 2.2534 2.4102 3.9245 1.3952 1.8696 1.2189 3.3828 1.9771 3.2883 2.7458 2.5774 2.6100 1.3865 1.2935 1.2634 2.6102 2.1735 1.4245 1.7341 1.4762 3.0162 1.3844 2.0740 1.5667 1.3711 2.3326 2.0300 2.0217 1.6457 1.3111 1.3546 3.2665 1.5790 1.5968 1.5005 1.9425 3.4923 3.7939 1.9367 1.2597 2.5080 1.4895 1.3717 1.1979 1.2640 1.4262 1.1117 1.2057 1.0755 1.1911 1.1175 1.2948 1.7618 1.1574 1.1218 1.6865 1.6485 1.1189 1.0551 1.1682 4.5072 5.4360 5.3034 7.5334 6.0750 6.0177 4.5756 1.0615 1.0349 1.0306 1.0342 1.0597 1.0638 1.0363 1.0607 1.0990 1.1007 1.1030 1.1050 1.0968 1.0605 1.0973 1.0987 1.0934 1.1001 1.1019 1.0857 1.1044 1.0815 1.1057 1.0930 1.0916 1.1146 1.0782
irintensity: 3.4442 0.6360 2.6238 2.0459 0.8149 0.9097 4.9019 4.7597 2.8218 4.2104 1.5755 0.5835 1.3350 1.0736 4.2934 1.0259 0.7337 1.6450 0.2020 0.4962 1.7397 0.3348 9.4969 7.4023 2.2543 7.1428 0.9108 5.3865 7.0712 2.4378 0.5692 1.6396 0.0231 1.4876 8.6192 7.9175 0.8568 4.7934 19.0958 1.1978 18.2851 7.3371 1.1618 8.8798 3.3729 7.1213 39.7495 20.3978 14.3727 16.3855 19.8921 5.1335 0.8011 15.5252 8.1196 3.1063 8.0095 23.4621 3.7470 4.4009 0.3879 9.7063 13.4520 0.3398 11.2811 17.6117 21.0361 17.7568 2.1938 113.2871 6.8725 9.6228 69.5196 31.1078 25.0315 9.1426 58.9290 15.5033 17.0351 26.2907 6.7321 30.8473 99.3652 8.0937 9.6789 21.9489 6.0688 1.1620 4.1053 30.9076 15.3504 2.7012 1.3496 31.0678 27.7573 3.3510 68.3859 51.6510 7.8012 79.6059 175.6428 97.8902 39.5403 15.5949 67.4154 146.7297 34.7365 36.7587 15.9040 14.2188 70.4845 446.2980 34.7802 82.5532 24.9133 45.5209 11.5837 4.5000 15.0604 5.2257 37.9751 27.6241 28.1877 52.1437 33.5653 47.5781 90.1064 18.0514 33.8360 28.1777 146.3530 9.5374 17.7657 4.1830 28.6112 51.3041 12.1676 96.7391 149.8182 67.1627 23.4453 189.6077 98.6883 34.0536 97.8102 21.1815 25.6296 9.5934 5.0572 19.0318 5.3728 25.2395 29.3066 26.3633 6.6549 41.6505 11.8948 9.0032 13.7104 18.6985 2.5601 16.4030 2.2545 19.3499 9.1003 3.4395 26.2940 33.2484
temp: 298.150 k
press: 1.00000 atm
elementType: 8 8 8 8 8 8 7 6 6 6 6 6 6 6 6 6 6 6 6 6 6 6 6 6 6 6 6 6 6 6 6 1 1 1 1 1 1 1 1 1 1 1 1 1 1 1 1 1 1 1 1 1 1 1 1 1 1 1
symmnumber: 1
zpe: 1211633.7 jmol-1
zpe.correction: 0.461487 hartree
zpe.thermalcorrener: 0.492944 hartree
zpe.thermalcorrenthalpy: 0.493888 hartree
zpe.thermalcorrgfe: 0.397538 hartree
zpe.sumelectzpe: -1434.484003 hartree
zpe.sumelectthermal: -1434.452546 hartree
zpe.sumelectthermalent: -1434.451602 hartree
zpe.sumelectthermalfe: -1434.547952 hartree
dipole: -7.7086 -1.0564 -1.0043
dipole: 7.8452
quadrupole: -184.4768 -192.1307 -177.8388
quadrupole: -15.4828 -9.7697 7.3414
quadrupole: 0.3386 -7.3153 6.9766 -15.4828 -9.7697 7.3414
hfenergy: -1434.9454898 hartree
pointgroup: C01 [X(C24H27N1O6)]
dipole: 3.0383347 0.4911315 0.2326604 debye
polarizability: 419.129874|9.8194614|290.1333924|29.5676007|35.4769868|239.0718965 unknown
InChI: InChI=1S/C24H27NO6/c1-6-7-16-21-15(9-11-18(27)22(16)28)20-14(8-10-17(21)25-13(2)26)12-19(29-3)23(30-4)24(20)31-5/h6,9,11-12,17,25,28H,1,7-8,10H2,2-5H3
charge 0 multiplicity 1
58 atoms
O  1.762393 -2.146363 0.129291
O  4.349219 -1.225698 0.647837
O  5.013732 1.573913 -0.128623
O  -4.783595 -1.178618 -1.40433
O  -1.950044 0.930242 3.170057
O  -3.684802 -2.808697 -2.898448
N  -0.223744 1.239636 1.637992
C  -1.139182 1.500041 0.503849
C  -0.667955 2.70833 -0.362872
C  -1.451304 0.24253 -0.353753
C  0.36115 2.372729 -1.476265
C  -0.337726 -0.428234 -0.937249
C  1.432258 1.421466 -0.980184
C  1.061027 0.073598 -0.681829
C  -2.855105 -0.100042 -0.481118
C  2.068344 -0.79671 -0.18382
C  2.758303 1.84655 -0.780854
C  -0.357493 -1.572292 -1.807704
C  -3.909494 0.625064 0.378833
C  -3.409472 -1.065731 -1.3477
C  3.412863 -0.372882 0.023257
C  3.764562 0.97281 -0.293985
C  -1.399669 -2.281964 -2.391663
C  -0.705512 0.9853 2.911258
C  -2.80939 -2.080713 -2.256816
C  -4.385145 1.939474 -0.224138
C  0.354115 0.786958 3.991002
C  1.148029 -2.335435 1.463344
C  4.720985 -2.445852 -0.107888
C  -4.470813 3.115899 0.447455
C  6.246332 0.770452 -0.03382
H  -2.065881 1.827142 0.988932
H  -1.564559 3.160895 -0.825626
H  -0.248105 3.460343 0.333119
H  -0.174891 1.909408 -2.326541
H  0.811912 3.309743 -1.848819
H  0.783678 1.266544 1.475988
H  3.055956 2.872605 -1.019012
H  0.640422 -1.927762 -2.087335
H  -3.540491 0.769667 1.409923
H  -4.789226 -0.039735 0.441715
H  -1.134783 -3.107313 -3.063828
H  -4.712713 1.885257 -1.273164
H  0.174937 -0.175355 4.500423
H  1.387273 0.803891 3.602915
H  0.245704 1.580852 4.750411
H  -4.917656 -1.947243 -2.087802
H  1.855321 -2.021977 2.254225
H  0.205689 -1.762866 1.54256
H  0.940482 -3.412879 1.544572
H  5.414032 -2.993822 0.548723
H  3.825511 -3.052719 -0.319419
H  5.231833 -2.17083 -1.051823
H  -4.866241 4.020011 -0.029568
H  -4.170074 3.199881 1.499817
H  6.279826 0.199249 0.906316
H  7.056686 1.514671 -0.072454
H  6.333692 0.078587 -0.892866
